program: Gaussian 09
title: 000267660
version: EM64L-G09RevD.01
frameworkgroup: C1[X(C4H3F3N4O)]
method: RPBEPBE
basis: SDD
operation: Freq
keyword: #p
keyword: freq=noraman
keyword: PBEPBE/SDD
title: #p freq=noraman PBEPBE/SDD
converged: NO NO NO NO
title: Mulliken charges:
elementType: F F F O N N N N C C C C H H H
charge: -0.184735 -0.131747 -0.131794 -0.121895 -0.405552 -0.450277 -0.069342 -0.005703 0.342799 0.160855 0.304132 -0.275457 0.355193 0.339513 0.274012
chargesum: 0.00000
title: Mulliken charges with hydrogens summed into heavy atoms:
elementType: F F F O N N N N C C C C
charge: -0.184735 -0.131747 -0.131794 -0.121895 -0.050360 -0.110764 -0.069342 -0.005703 0.342799 0.160855 0.304132 -0.001445
polarizability: 1.12764174e+02 5.92877986e+00 7.65908568e+01 6.93185643e-03 2.56987893e-03 3.93148972e+01
1716.lowfreq: -22.0370 -3.9973 -2.1799 -0.0012 -0.0010 -0.0004 10.3129 27.3789 84.8868
frequency: -21.9630 27.0617 84.8778 109.8859 223.9427 229.7967 279.0722 331.8763 336.0823 389.4797 437.4670 498.4320 616.0787 622.7045 635.4381 677.8789 695.2877 711.7563 748.1864 843.5389 854.7308 914.2731 975.7822 1002.3728 1037.3026 1057.1359 1091.6530 1170.0058 1209.5414 1227.8731 1242.0003 1351.3412 1380.9928 1538.5415 1559.1639 1675.4928 3263.9961 3509.3581 3597.6686
redmass: 6.6596 15.5240 6.7919 9.1746 11.6926 13.5250 15.5085 9.4913 5.9086 12.0636 14.2465 15.5818 1.2481 15.3590 4.5306 1.5287 3.3296 7.8160 10.2440 8.1577 1.3492 9.4543 4.3408 10.7625 12.9699 6.5307 6.7812 2.8636 3.0517 4.4842 2.6244 2.1290 2.4187 1.8867 4.2061 9.9282 1.0995 1.0769 1.0831
irintensity: 0.6330 0.7833 4.9847 1.4044 6.7395 3.1775 0.8325 1.7647 0.9355 4.1512 4.2336 7.1878 11.8879 30.0613 1.0307 155.2012 49.1602 40.9611 24.3003 26.1591 27.3284 22.1287 5.1189 172.0197 255.6445 5.6110 287.6127 8.6411 34.9525 14.0136 11.7954 3.7414 4.2109 21.8545 363.2585 273.5712 0.8374 70.0197 65.9438
temp: 298.150 k
press: 1.00000 atm
elementType: 9 9 9 8 7 7 7 7 6 6 6 6 1 1 1
symmnumber: 1
zpe: 228235.9 jmol-1
zpe.correction: 0.086930 hartree
zpe.thermalcorrener: 0.096509 hartree
zpe.thermalcorrenthalpy: 0.097454 hartree
zpe.thermalcorrgfe: 0.050247 hartree
zpe.sumelectzpe: -747.066600 hartree
zpe.sumelectthermal: -747.057021 hartree
zpe.sumelectthermalent: -747.056077 hartree
zpe.sumelectthermalfe: -747.103283 hartree
dipole: 1.2827 4.8418 -0.0027
dipole: 5.0088
quadrupole: -76.3751 -66.9750 -67.8178
quadrupole: -0.7748 0.0014 0.0011
quadrupole: -5.9858 3.4143 2.5715 -0.7748 0.0014 0.0011
hfenergy: -747.1535307 hartree
pointgroup: C01 [X(C4H3F3N4O1)]
dipole: 0.5200423 -1.9007755 0.0003416 debye
dipolederiv: -0.529867 -0.0480037 -0.0000155 -0.0648786 -0.8797462 0.0006408 -0.0000768 0.0004847 -0.2972473 -0.6231879 0.0539438 0.2604257 0.0237117 -0.2862927 -0.0922199 0.2416126 -0.1175817 -0.629429 -0.6222993 0.0532113 -0.2600018 0.0230763 -0.2859814 0.0917178 -0.2416053 0.1170913 -0.6306305 -0.4602782 -0.0267273 -0.0000745 0.6073722 -0.8195375 -0.0002385 -0.0006803 0.0005896 -0.2571096 -1.4244882 0.3192259 -0.0000141 0.3295588 -0.5634088 -0.0000404 -0.0001927 -0.0001316 -0.2985028 -0.0603722 -0.2732613 -0.0003576 0.0435639 -0.4707241 -0.0002113 0.0000853 -0.0000045 -0.2409362 -0.4886412 -0.0944914 0.0001643 -0.1782508 -0.4165223 -0.0001908 0.0000849 -0.0001972 -0.2012189 -0.4329174 0.3501888 0.0002765 -0.0247292 -0.0778243 0.0000025 -0.0000704 -0.0000842 -0.1759889 1.0373964 -0.0649166 -0.0003438 0.1738701 0.5374201 0.0004795 -0.0003898 0.0004802 0.1870962 1.0668725 -0.2510838 0.0002647 -1.0484263 1.2111894 0.0001055 0.0010998 -0.0004811 0.1308157 1.6778168 -0.1330489 -0.0003855 -0.0497633 1.3466739 -0.0000863 -0.00027 -0.0000502 1.5877233 0.3594716 0.1085785 -0.0001379 0.2062645 0.1831287 0.0002892 0.0000334 0.0000689 -0.0702375 0.2571977 0.0572401 0.0000788 0.0550492 0.2085613 -0.0000118 0.0002357 -0.0000131 0.3372011 0.1929873 -0.0155879 0.0001149 -0.053739 0.2294658 -0.0001564 0.0000482 -0.0001567 0.376109 0.0503091 -0.0352677 0.0000058 -0.0426796 0.0835982 -0.0000799 0.0000853 -0.0000144 0.1823553 unknown
polarizability: 112.8575981|-5.6357898|76.4974239|-0.0139017|0.0165499|39.3149056 unknown
InChI: InChI=1S/C4H3F3N4O/c5-4(6,7)2(12)10-3-8-1-9-11-3/h1,10-11H
charge 0 multiplicity 1
15 atoms
F  -2.304959 -1.627248 0.001345
F  -3.144105 0.16165 1.13235
F  -3.141873 0.159657 -1.134477
O  -0.914323 1.739638 -0.000261
N  0.032361 -0.444336 0.000728
N  2.348994 -1.188076 -0.001201
N  2.02253 1.02986 0.000944
N  3.640947 -0.644391 -0.001422
C  1.404849 -0.171052 0.000247
C  -0.996382 0.496636 0.000788
C  -2.397818 -0.195242 0.000026
C  3.372418 0.691014 0.000288
H  -0.256829 -1.42756 0.001146
H  2.247914 -2.201848 -0.00228
H  4.168075 1.430397 0.000579
