program: Gaussian 09
title: 000267662
version: EM64L-G09RevD.01
frameworkgroup: C1[X(C11H8F7NO)]
method: RPBEPBE
basis: SDD
operation: Freq
keyword: #p
keyword: freq=noraman
keyword: PBEPBE/SDD
title: #p freq=noraman PBEPBE/SDD
converged: YES YES NO NO
title: Mulliken charges:
elementType: F F F F F F F O N C C C C C C C C C C C H H H H H H H H
charge: -0.173552 -0.124573 -0.146259 -0.130623 -0.128454 -0.120678 -0.130971 -0.204977 -0.434000 0.155807 0.257565 0.120531 0.377537 0.501726 -0.442655 -0.330008 0.448823 -0.361892 -0.381103 -0.803895 0.350479 0.227626 0.301995 0.237200 0.237221 0.240374 0.226671 0.230085
chargesum: 0.00000
title: Mulliken charges with hydrogens summed into heavy atoms:
elementType: F F F F F F F O N C C C C C C C C C C C
charge: -0.173552 -0.124573 -0.146259 -0.130623 -0.128454 -0.120678 -0.130971 -0.204977 -0.083521 0.155807 0.257565 0.120531 0.377537 0.501726 -0.215028 -0.028013 0.448823 -0.124692 -0.143882 -0.106766
polarizability: 2.12310478e+02 9.03829067e+00 1.18012081e+02 2.01214327e+01 -1.90020826e+01 9.20907609e+01
1716.lowfreq: -25.6995 -7.5461 -4.1288 -0.0005 -0.0005 -0.0004 5.3222 11.8424 27.4233
frequency: -25.4984 11.7367 27.3993 34.2768 57.0937 76.0788 99.5184 127.7552 140.2384 180.0524 202.0986 208.8329 236.0558 256.2280 280.3326 289.4580 298.8411 315.5808 335.8210 353.7541 369.5047 396.0565 408.2495 451.4556 461.0961 502.5586 511.5052 519.7916 536.2935 576.2845 634.0911 652.3886 674.8642 709.4470 719.5276 738.9983 803.1598 827.3879 848.2315 852.9973 883.0873 950.5760 984.0054 987.7286 994.0154 1005.6810 1010.8543 1030.6667 1048.3877 1057.6102 1063.3894 1086.4599 1133.6675 1138.5426 1189.1699 1198.0508 1199.6595 1226.2473 1261.5262 1317.0072 1373.5808 1400.2121 1414.2298 1469.8201 1472.9493 1507.8294 1523.6276 1600.3313 1625.3764 1638.9221 2977.3161 3059.0110 3088.5979 3114.4470 3134.9939 3143.4050 3194.0449 3503.3229
redmass: 1.0154 7.9144 13.8164 4.9742 7.7568 6.9716 7.3746 9.8014 11.6543 5.3818 9.8406 12.4047 15.0258 8.9871 15.6163 15.6215 5.9156 15.5834 15.1956 4.3960 3.9276 9.9911 2.9423 14.8145 11.8947 5.1966 6.7017 5.7063 6.7906 15.2100 7.0579 15.4595 7.3351 1.4548 2.2462 5.4870 6.8786 1.4698 6.2554 1.2919 12.5075 1.3515 2.6516 1.4886 2.0282 7.9082 3.4598 12.5334 1.5658 12.7531 10.3930 10.6914 1.3060 11.6773 4.0509 1.1922 9.1708 2.6185 2.4750 1.3584 5.4228 1.2197 3.4545 1.1111 1.0550 2.5621 1.9761 3.9997 6.3401 9.9761 1.0390 1.0947 1.0999 1.0884 1.0911 1.0962 1.0947 1.0764
irintensity: 0.5991 1.1842 0.0843 0.0072 0.6885 1.0875 1.1233 3.6762 2.7905 4.8059 1.2289 5.9849 6.1286 1.3483 0.9011 0.8898 3.8155 0.9265 1.7760 0.5631 1.3359 5.8576 0.0362 11.5994 10.1443 25.0367 18.0178 11.6213 0.3204 8.7290 1.3309 37.5736 2.9567 47.4021 5.9048 16.6681 35.4341 68.6172 20.7934 20.3851 162.5866 5.7447 30.9119 10.8079 22.4955 12.5095 11.8716 65.6072 26.4309 275.6130 61.7303 327.7451 16.6306 52.7916 14.0423 3.9976 59.7049 1.7948 0.5931 4.7347 15.8231 10.0801 13.2438 25.3648 13.2928 38.7671 159.3867 21.1232 6.8335 323.6448 31.3266 20.8646 16.3981 13.0224 18.4853 13.0123 2.7483 45.3896
temp: 298.150 k
press: 1.00000 atm
elementType: 9 9 9 9 9 9 9 8 7 6 6 6 6 6 6 6 6 6 6 6 1 1 1 1 1 1 1 1
symmnumber: 1
zpe: 464948.9 jmol-1
zpe.correction: 0.177090 hartree
zpe.thermalcorrener: 0.195491 hartree
zpe.thermalcorrenthalpy: 0.196436 hartree
zpe.thermalcorrgfe: 0.127931 hartree
zpe.sumelectzpe: -1251.355728 hartree
zpe.sumelectthermal: -1251.337326 hartree
zpe.sumelectthermalent: -1251.336382 hartree
zpe.sumelectthermalfe: -1251.404886 hartree
dipole: -5.1878 1.6076 -1.4911
dipole: 5.6322
quadrupole: -99.6585 -111.0627 -118.7108
quadrupole: -0.6486 1.5886 -2.3262
quadrupole: 10.1522 -1.2521 -8.9001 -0.6486 1.5886 -2.3262
hfenergy: -1251.5328172 hartree
pointgroup: C01 [X(C11H8F7N1O1)]
dipole: 2.0176149 -0.2485561 0.8817718 debye
polarizability: 213.2743246|-18.5591345|81.4207062|2.5265028|-4.9851139|127.7182898 unknown
InChI: InChI=1S/C11H8F7NO/c1-6-2-4-7(5-3-6)19-8(20)9(12,13)10(14,15)11(16,17)18/h2-5,19H,1H3
charge 0 multiplicity 1
28 atoms
F  -1.633694 1.023926 1.977471
F  -2.469941 1.985006 0.07572
F  -2.153072 -1.492501 1.078989
F  -3.967881 -0.093944 1.129535
F  -2.116166 -1.502952 -1.650846
F  -3.640741 0.182687 -1.798504
F  -4.227175 -1.811747 -0.897356
O  -0.380103 0.820106 -1.408617
N  0.6033 0.427955 0.713755
C  -1.808639 0.835538 0.556903
C  -2.778352 -0.392124 0.428747
C  -0.427068 0.691475 -0.154571
C  -3.187996 -0.874602 -1.008401
C  1.979415 0.211826 0.395979
C  2.861138 -0.043012 1.477743
C  2.479485 0.232433 -0.931302
C  4.752732 -0.25878 -0.084341
C  4.227809 -0.275833 1.234541
C  3.852081 -0.004662 -1.150248
C  6.231896 -0.48074 -0.341302
H  0.363204 0.400819 1.710184
H  2.479226 -0.066213 2.506556
H  1.804657 0.427687 -1.766657
H  4.896123 -0.475593 2.080096
H  4.230462 0.009106 -2.179219
H  6.784894 0.478755 -0.331737
H  6.685514 -1.127857 0.429668
H  6.405991 -0.948259 -1.326087
