program: Gaussian 09
title: 000022747
version: EM64L-G09RevD.01
frameworkgroup: C1[X(C4H4Br2O2)]
method: RPBEPBE
basis: SDD
operation: Freq
keyword: #p
keyword: freq=noraman
keyword: PBEPBE/SDD
title: #p freq=noraman PBEPBE/SDD
converged: YES YES NO NO
title: Mulliken charges:
elementType: Br Br O O C C C C H H H H
charge: 0.051350 0.051439 -0.133249 -0.133340 0.207611 0.207696 -0.759966 -0.759997 0.317109 0.317141 0.317196 0.317010
chargesum: 0.00000
title: Mulliken charges with hydrogens summed into heavy atoms:
elementType: Br Br O O C C C C
charge: 0.051350 0.051439 -0.133249 -0.133340 0.207611 0.207696 -0.125716 -0.125792
polarizability: 1.25752835e+02 -1.04387647e+01 6.64331985e+01 -3.49511841e-02 2.43498035e-02 3.51609000e+01
1716.lowfreq: -8.8655 -1.4157 -0.0005 -0.0003 0.0005 4.7838 23.8806 47.0435 49.8204
frequency: 23.8805 47.0432 49.6431 86.1222 141.4545 227.1685 227.2845 331.6296 478.0037 545.2207 546.5510 685.6759 701.2349 778.3122 794.7238 885.7240 953.7070 1086.5131 1105.6441 1131.0037 1239.8209 1258.0937 1394.1143 1395.5325 1623.0231 1635.4485 3041.1640 3041.9608 3108.5465 3108.8458
redmass: 9.4967 3.1760 3.2197 11.6128 33.1013 16.5828 11.7504 3.3711 9.4916 10.2092 2.0325 5.3222 6.7741 8.4178 1.6921 2.0165 3.3808 1.0473 2.6678 1.2149 1.3778 1.7219 1.0948 1.1005 10.6196 10.8277 1.0577 1.0583 1.1036 1.1036
irintensity: 1.1588 20.8085 0.0005 2.5994 0.0000 6.1645 0.7398 0.4239 0.0000 121.0723 0.0595 0.0000 3.6690 0.0036 21.2722 0.0004 40.6727 4.2016 0.0001 0.0002 32.2740 0.0007 96.5158 0.0254 0.0398 144.7583 29.8669 0.7603 0.3421 0.2094
temp: 298.150 k
press: 1.00000 atm
elementType: 35 35 8 8 6 6 6 6 1 1 1 1
symmnumber: 1
zpe: 189447.1 jmol-1
zpe.correction: 0.072157 hartree
zpe.thermalcorrener: 0.081640 hartree
zpe.thermalcorrenthalpy: 0.082585 hartree
zpe.thermalcorrgfe: 0.032694 hartree
zpe.sumelectzpe: -331.550045 hartree
zpe.sumelectthermal: -331.540561 hartree
zpe.sumelectthermalent: -331.539617 hartree
zpe.sumelectthermalfe: -331.589508 hartree
dipole: 0.0014 0.0005 0.0092
dipole: 0.0093
quadrupole: -74.1757 -69.5015 -62.5253
quadrupole: 7.0085 0.0063 0.0150
quadrupole: -5.4415 -0.7673 6.2088 7.0085 0.0063 0.0150
hfenergy: -331.6222019 hartree
pointgroup: C01 [X(C4H4Br2O2)]
dipole: -0.0005552 -0.0036231 -0.0000814 debye
dipolederiv: -0.4155567 -0.0003809 0.0327349 0.0011362 -0.0752954 0.0003449 0.124707 0.0005947 -0.0584818 -0.4154618 0.0000471 0.0327303 0.0025129 -0.0752267 0.0003835 0.1246855 0.0003607 -0.0584254 -0.5241207 -0.0010588 -0.0098004 -0.0039595 -0.2499499 -0.0064984 -0.1948653 -0.0068855 -0.6629873 -0.5242831 -0.0012025 -0.009844 -0.0044015 -0.2499782 -0.0066915 -0.1951639 -0.0073505 -0.6627571 0.69068 0.0037318 0.1378884 0.0098907 0.1619339 0.009025 0.5187692 0.0100431 0.7106367 0.6899867 0.0048513 0.1381112 0.012022 0.1619082 0.009595 0.5191244 0.0103759 0.7101825 0.292015 -0.0042546 -0.3050591 -0.0090523 0.0383935 -0.0041905 -0.5939093 -0.0049635 -0.1718752 0.2917329 -0.0063519 -0.305092 -0.0138585 0.0383952 -0.0047474 -0.5936901 -0.0049357 -0.1717517 -0.0210066 -0.0473694 0.0727386 -0.0241458 0.063837 0.0469862 0.0728591 0.0564587 0.0897036 -0.0214974 0.0492242 0.0714197 0.0259999 0.0610806 -0.0455905 0.0722687 -0.055157 0.0930503 -0.021174 -0.0469133 0.0732231 -0.0231337 0.0645924 0.0470123 0.0730548 0.0565478 0.0893069 -0.0213141 0.0496772 0.0709492 0.0269894 0.0603093 -0.0456287 0.07216 -0.0550886 0.0933984 unknown
polarizability: 124.0444885|-0.0550852|35.1695482|-14.4013108|0.5234709|68.1328966 unknown
InChI: InChI=1S/C4H4Br2O2/c5-1-3(7)4(8)2-6/h1-2H2
charge 0 multiplicity 1
12 atoms
Br 3.646868 0.529802 -0.278437
Br -3.647016 0.521652 0.237347
O  0.787764 0.501481 -1.613319
O  -0.787651 0.546529 1.571766
C  0.701748 0.520534 -0.364507
C  -0.701851 0.526684 0.322863
C  1.865551 0.539376 0.614674
C  -1.865923 0.50579 -0.655876
H  1.821685 -0.340886 1.277737
H  1.816492 1.440058 1.249363
H  -1.820302 1.382675 -1.323251
H  -1.818665 -0.398095 -1.286261
