program: Gaussian 09
title: 000267674
version: EM64L-G09RevD.01
frameworkgroup: C1[X(C14H15N5O)]
method: RPBEPBE
basis: SDD
operation: Freq
keyword: #p
keyword: freq=noraman
keyword: PBEPBE/SDD
title: #p freq=noraman PBEPBE/SDD
converged: NO YES NO NO
title: Mulliken charges:
elementType: O N N N N N C C C C C C C C C C C C C C H H H H H H H H H H H H H H H
charge: -0.280468 -0.203111 -0.071828 -0.114861 -0.640779 -0.591295 -0.114847 -0.445388 0.037518 0.080134 -0.693954 0.131879 0.141244 0.262792 -0.047653 -0.320918 -0.367013 -0.254306 -0.225082 -0.229587 0.277425 0.243533 0.221546 0.256920 0.208082 0.236570 0.323668 0.330324 0.235624 0.267190 0.325450 0.329785 0.228939 0.231198 0.231269
chargesum: 0.00000
title: Mulliken charges with hydrogens summed into heavy atoms:
elementType: O N N N N N C C C C C C C C C C C C C C
charge: -0.280468 -0.203111 -0.071828 -0.114861 0.013213 0.063941 0.162578 0.019691 0.037518 0.080134 0.007618 0.131879 0.141244 0.262792 -0.047653 -0.085294 -0.099823 -0.025367 0.006115 0.001682
polarizability: 2.64966753e+02 2.35270315e+01 1.87168220e+02 -5.47057408e+00 1.53817884e+01 1.19748018e+02
1716.lowfreq: -5.8236 -0.0007 -0.0007 -0.0001 2.8015 8.9329 29.7112 37.9234 56.9267
frequency: 29.3000 37.8463 56.9189 79.7841 91.7214 133.1512 156.1739 176.1331 204.2239 213.6141 215.9969 233.1922 266.7628 274.9640 284.0580 343.1974 367.4487 377.9057 402.3731 412.7451 446.1786 465.8657 505.5313 522.1032 529.2362 531.8411 568.9987 604.0051 611.5062 617.7494 647.0467 684.8408 695.1422 704.4641 705.9696 747.0313 781.8846 788.8294 790.0271 856.1257 867.4467 906.6977 932.2050 969.6174 979.0193 989.3061 998.6458 1000.4602 1002.6429 1025.6089 1037.7390 1080.9352 1082.5845 1117.4580 1125.5135 1145.5455 1149.4333 1172.9478 1178.9820 1186.4639 1216.7592 1272.8856 1293.3647 1314.2588 1323.9735 1334.9594 1370.6837 1376.0712 1380.4499 1401.9572 1432.5349 1440.5565 1466.3562 1476.6810 1480.4858 1484.4053 1485.7651 1540.5467 1571.3427 1583.0421 1590.7222 1602.3455 1610.0907 1626.0443 2939.2894 2988.6517 2993.1003 3005.7246 3095.1665 3109.0086 3125.4123 3135.1725 3147.0658 3157.3639 3168.9823 3550.5742 3563.8749 3706.7392 3724.0756
redmass: 4.8029 4.1278 5.2366 5.0140 3.8358 3.4427 5.2005 3.3910 4.3788 4.3556 1.4722 2.3725 3.9965 3.6265 3.4878 3.5744 6.2131 1.2171 2.9034 4.6223 1.2147 3.5066 3.8891 1.2354 3.4482 1.0870 5.1659 5.4275 5.2309 5.4578 6.3593 5.5414 5.8720 4.5244 1.7218 3.8656 7.4158 2.3723 5.3290 1.2485 4.6321 2.4861 1.4553 3.2771 1.3941 5.2771 1.3913 2.2170 1.6628 2.2470 1.8739 1.7477 1.8465 1.9705 2.1314 2.4355 3.3100 1.0628 1.3795 1.1224 3.1168 2.1290 2.7009 1.3967 1.2270 2.3484 1.7149 2.7454 8.7243 4.2416 2.2533 5.4638 1.1558 1.0500 1.9175 1.7019 1.6842 8.6464 3.9547 4.8668 6.2732 1.5672 6.0885 1.6586 1.0613 1.0999 1.0356 1.0826 1.1003 1.1013 1.0847 1.0879 1.0928 1.0962 1.1008 1.0452 1.0440 1.1043 1.1059
irintensity: 0.1156 0.1540 1.3740 1.3913 1.1426 6.0304 1.1448 1.2771 0.7542 8.9119 3.4399 0.9961 4.4976 6.5114 6.6791 8.2661 3.2587 166.8753 0.2875 9.3744 284.2420 1.8334 4.7752 70.6974 14.5299 39.5021 8.5367 8.2135 2.1467 1.7064 19.6450 3.9820 5.2081 13.1513 77.5388 5.9738 15.0797 30.8977 5.2700 1.8646 19.6167 7.2879 3.2162 13.2891 2.4961 0.5799 0.4962 1.6064 1.1771 3.5091 18.9371 5.4181 13.1245 15.1161 3.4273 12.8715 13.4344 0.2126 2.8293 6.3478 3.2705 4.9431 0.3746 2.0338 8.8996 9.1046 192.6706 329.1915 9.5456 2.2009 13.3773 150.4997 29.3854 17.2524 8.5909 18.0147 40.6442 299.9439 161.8113 151.3700 7.7494 688.0174 4.2110 317.1313 50.4518 18.4232 18.7775 10.8166 22.3467 13.8098 1.6385 4.7902 28.7432 21.6306 18.3923 76.5740 120.9650 31.5264 45.5945
temp: 298.150 k
press: 1.00000 atm
elementType: 8 7 7 7 7 7 6 6 6 6 6 6 6 6 6 6 6 6 6 6 1 1 1 1 1 1 1 1 1 1 1 1 1 1 1
symmnumber: 1
zpe: 724922.8 jmol-1
zpe.correction: 0.276109 hartree
zpe.thermalcorrener: 0.293879 hartree
zpe.thermalcorrenthalpy: 0.294823 hartree
zpe.thermalcorrgfe: 0.230087 hartree
zpe.sumelectzpe: -890.086267 hartree
zpe.sumelectthermal: -890.068497 hartree
zpe.sumelectthermalent: -890.067553 hartree
zpe.sumelectthermalfe: -890.132289 hartree
dipole: -1.0554 5.6052 0.8136
dipole: 5.7614
quadrupole: -98.0388 -113.3232 -115.3628
quadrupole: 9.6066 0.8276 1.1820
quadrupole: 10.8695 -4.4150 -6.4545 9.6066 0.8276 1.1820
hfenergy: -890.362376 hartree
pointgroup: C01 [X(C14H15N5O1)]
dipole: -0.388704 -2.0857263 -0.797865 debye
polarizability: 264.360487|-25.8966888|178.0645039|6.9337794|26.7279464|129.4580002 unknown
InChI: InChI=1S/C14H15N5O/c1-8-11-10(12(15)18-14(16)17-11)7-19(8)13(20)9-5-3-2-4-6-9/h2-6,8H,7,15-16H2,1H3
charge 0 multiplicity 1
35 atoms
O  1.639424 2.233585 1.094935
N  0.294472 0.714292 -0.025421
N  -3.349752 0.953287 0.250352
N  -3.89279 -1.39322 -0.259012
N  -2.253866 -2.979504 -0.777457
N  -5.558987 0.169757 0.248095
C  -0.897998 1.601801 0.190963
C  -0.079515 -0.678431 -0.431329
C  -2.046032 0.620125 0.067015
C  -1.582788 -0.661421 -0.276406
C  -0.971854 2.768588 -0.818026
C  1.522108 1.121632 0.477468
C  -2.564432 -1.678058 -0.438218
C  2.722885 0.22817 0.284029
C  -4.221294 -0.103495 0.072313
C  3.008373 -0.432877 -0.938242
C  3.656791 0.145194 1.349381
C  4.198801 -1.17972 -1.085191
C  4.835465 -0.616701 1.209332
C  5.109493 -1.283947 -0.008727
H  -0.835884 2.026392 1.211454
H  0.430972 -1.418309 0.217671
H  0.221811 -0.893514 -1.477686
H  -0.107277 3.437883 -0.677746
H  -0.977827 2.392823 -1.856622
H  -1.902087 3.337661 -0.646025
H  -1.294139 -3.287069 -0.90086
H  -3.017914 -3.646437 -0.864909
H  2.326234 -0.332611 -1.789522
H  3.449237 0.70003 2.270131
H  -6.239409 -0.575954 0.136737
H  -5.835746 1.113637 0.502732
H  4.419029 -1.670538 -2.039805
H  5.544601 -0.681904 2.041854
H  6.030096 -1.867347 -0.121855
