program: Gaussian 09
title: 000267646
version: EM64L-G09RevD.01
frameworkgroup: C1[X(C10H12N4O5)]
method: RPBEPBE
basis: SDD
operation: Freq
keyword: #p
keyword: freq=noraman
keyword: PBEPBE/SDD
title: #p freq=noraman PBEPBE/SDD
converged: YES YES NO NO
title: Mulliken charges:
elementType: O O O O O N N N N C C C C C C C C C C H H H H H H H H H H H H
charge: -0.260912 -0.505722 -0.449876 -0.434852 -0.203766 -0.222443 -0.360032 -0.029101 -0.008635 -0.163945 0.020225 -0.138050 -0.111721 -0.329871 0.305557 -0.221488 -0.123956 0.031936 -0.248914 0.279516 0.246111 0.234612 0.239348 0.252985 0.221503 0.297095 0.381146 0.365783 0.350229 0.350540 0.236698
chargesum: 0.00000
title: Mulliken charges with hydrogens summed into heavy atoms:
elementType: O O O O O N N N N C C C C C C C C C C
charge: -0.260912 -0.124576 -0.084094 -0.084623 -0.203766 -0.222443 -0.009493 -0.029101 -0.008635 0.115571 0.266337 0.096562 0.127627 0.144617 0.305557 0.075607 -0.123956 0.031936 -0.012216
polarizability: 2.05227841e+02 3.48225773e+00 1.48458191e+02 5.86345237e+00 -6.29828894e+00 9.27703768e+01
1716.lowfreq: -10.6670 -4.9008 -1.6639 -0.0010 -0.0008 -0.0007 36.2643 38.6509 62.0119
frequency: 36.2185 38.6320 62.0009 100.8075 110.5541 127.7767 183.6530 202.6131 211.5233 221.0610 231.8476 245.9969 264.8704 266.9329 287.9545 335.2587 368.8537 407.0543 441.8506 475.0964 484.3695 488.9376 498.3390 505.2316 571.4220 584.5419 625.1662 628.2187 651.6804 661.1179 686.2998 718.1291 772.3915 802.9626 817.0784 839.3648 866.6158 878.1774 888.1357 911.6919 928.4106 937.2528 971.5867 999.1577 1022.3828 1029.5274 1057.9773 1068.2071 1085.6540 1115.4363 1148.1946 1173.2020 1190.7626 1199.0485 1206.9726 1247.7561 1258.7990 1271.2319 1294.0259 1308.3722 1323.1886 1329.1201 1340.8215 1346.4966 1357.8678 1360.5695 1367.9042 1380.7241 1401.8516 1417.5155 1442.1010 1513.2030 1532.8834 1593.4100 1634.3861 2938.6234 2955.5108 2993.8729 3008.6898 3056.7525 3118.9700 3122.3589 3275.0448 3475.2007 3533.4441 3575.4392 3609.9902
redmass: 6.5860 6.0548 6.9991 6.8562 7.1953 5.6143 6.5191 3.9827 5.8963 1.4099 2.1445 3.8007 2.8178 2.7509 7.1653 6.0499 2.8795 3.7717 4.2792 5.5451 6.2370 2.5627 3.2785 1.6188 6.4723 7.3410 4.8787 4.3239 2.0802 3.0985 5.1316 5.6607 4.6431 1.6512 3.6140 3.5736 6.9966 3.2331 1.4712 3.9277 3.6078 5.2069 5.0323 3.9335 3.8360 2.6345 2.4343 3.2744 3.5801 2.4860 2.6678 1.1770 1.1627 1.9094 1.2767 1.1792 1.6745 2.1820 1.3452 1.2652 1.7018 2.0108 1.3769 2.7844 1.4601 1.5901 1.3837 1.5701 1.6207 3.9370 1.0869 4.5571 5.9353 7.0752 12.5554 1.0830 1.0853 1.0756 1.0757 1.0869 1.0922 1.0996 1.0991 1.0797 1.0650 1.0668 1.0671
irintensity: 4.5752 1.8200 3.0103 8.8168 5.1104 5.3670 1.2505 23.8250 12.6731 134.8283 27.7022 26.6664 2.1717 32.9083 3.4012 7.3539 21.7265 12.0998 15.1398 6.6218 1.8038 99.0787 24.3027 170.1913 4.2446 5.0418 14.2757 36.5666 84.7046 25.3120 12.6727 17.7449 15.3733 10.2349 20.8233 11.5638 12.1549 20.9180 11.1999 21.3503 12.6592 29.0760 39.9638 142.8149 66.2941 8.8021 37.3258 104.8197 45.6880 5.6145 6.6604 8.4004 36.8302 110.4519 38.3600 5.1151 1.6759 3.8809 9.8262 18.7081 54.7575 18.7038 35.5438 18.7987 22.9637 16.4339 14.0049 12.6435 2.5177 7.0187 13.6682 41.9276 355.0832 50.8875 415.7949 18.9675 60.7073 8.8346 64.4188 9.0381 22.9534 8.1022 5.9981 151.3360 13.5116 11.3885 31.9160
temp: 298.150 k
press: 1.00000 atm
elementType: 8 8 8 8 8 7 7 7 7 6 6 6 6 6 6 6 6 6 6 1 1 1 1 1 1 1 1 1 1 1 1
symmnumber: 1
zpe: 604235.7 jmol-1
zpe.correction: 0.230141 hartree
zpe.thermalcorrener: 0.246936 hartree
zpe.thermalcorrenthalpy: 0.247880 hartree
zpe.thermalcorrgfe: 0.185531 hartree
zpe.sumelectzpe: -981.921737 hartree
zpe.sumelectthermal: -981.904943 hartree
zpe.sumelectthermalent: -981.903999 hartree
zpe.sumelectthermalfe: -981.966347 hartree
dipole: -13.8254 6.7284 1.4105
dipole: 15.4403
quadrupole: -149.6689 -110.9307 -102.3309
quadrupole: 12.3264 -9.6059 6.9519
quadrupole: -28.6921 10.0461 18.6459 12.3264 -9.6059 6.9519
hfenergy: -982.1518786 hartree
pointgroup: C01 [X(C10H12N4O5)]
dipole: 5.4475573 -2.565705 0.8019877 debye
polarizability: 205.2809248|3.3094861|149.1340197|-5.2517018|1.8817572|92.0414642 unknown
InChI: InChI=1S/C10H12N4O5/c15-4-1-19-10(7(17)6(4)16)14-3-13-5-8(14)11-2-12-9(5)18/h2-4,6-7,10-11,15-17H,1H2
charge 0 multiplicity 1
31 atoms
O  1.900655 1.27865 -0.825927
O  1.03809 -1.853961 0.99854
O  3.316757 -1.971686 -0.555093
O  4.211805 1.26153 1.031107
O  -4.893966 0.911316 0.199245
N  -0.230451 0.582123 -0.200403
N  -1.559063 -1.546074 -0.240631
N  -1.980528 2.04016 0.048792
N  -3.953318 -1.238047 -0.079296
C  1.775081 -0.582741 0.770055
C  1.131291 0.098273 -0.462356
C  3.251141 -0.945263 0.490306
C  4.044761 0.270846 -0.041624
C  3.290857 0.94485 -1.192604
C  -1.395985 -0.174741 -0.156644
C  -0.652423 1.934709 -0.068395
C  -2.474257 0.720155 -0.008601
C  -3.856992 0.217368 0.051173
C  -2.888844 -1.998983 -0.194613
H  1.700579 0.09959 1.636508
H  1.108273 -0.632843 -1.302707
H  3.716658 -1.318767 1.428057
H  5.019908 -0.094238 -0.423805
H  3.753367 1.912007 -1.437679
H  3.296649 0.275897 -2.075498
H  0.063823 2.748879 -0.091405
H  0.829533 -1.962446 1.958144
H  2.710082 -2.708758 -0.280821
H  4.960524 0.989983 1.618858
H  -0.752561 -2.173286 -0.146658
H  -3.003047 -3.0882 -0.266124
