program: Gaussian 09
title: 000267645
version: EM64L-G09RevD.01
frameworkgroup: C1[X(C10H13N5O3)]
method: RPBEPBE
basis: SDD
operation: Freq
keyword: #p
keyword: freq=noraman
keyword: PBEPBE/SDD
title: #p freq=noraman PBEPBE/SDD
converged: YES YES NO NO
title: Mulliken charges:
elementType: O O O N N N N N C C C C C C C C C C H H H H H H H H H H H H H
charge: -0.262543 -0.479908 -0.448883 -0.192820 -0.083607 -0.196780 -0.060421 -0.603681 -0.201440 -0.119130 -0.063380 -0.354752 -0.335148 0.243112 -0.196809 -0.099178 0.172784 -0.327426 0.282062 0.216562 0.259781 0.210002 0.237579 0.171684 0.213267 0.403567 0.294181 0.378601 0.253482 0.350280 0.338960
chargesum: 0.00000
title: Mulliken charges with hydrogens summed into heavy atoms:
elementType: O O O N N N N N C C C C C C C C C C
charge: -0.262543 -0.076341 -0.070282 -0.192820 -0.083607 -0.196780 -0.060421 0.085559 0.080623 0.097432 0.196401 0.092829 0.049803 0.243112 0.097372 -0.099178 0.172784 -0.073943
polarizability: 2.08212058e+02 8.79272707e+00 1.56861679e+02 -9.95081425e+00 6.37726823e+00 8.69133306e+01
1716.lowfreq: -5.4253 -3.0362 0.0002 0.0005 0.0006 7.1574 40.4201 48.3816 79.9045
frequency: 40.4154 48.3248 79.8934 96.0075 123.2180 158.9391 171.5387 196.5232 227.1613 258.1200 266.9482 286.7293 309.9470 319.5252 394.6618 429.2788 471.8504 520.5940 540.9946 547.2957 557.6204 561.1070 570.1640 590.4791 615.3452 630.4002 643.0807 664.0222 710.3294 792.0266 795.0293 845.7863 860.0508 864.5796 875.0718 922.3279 933.5080 938.6659 962.6702 971.7706 996.7780 1022.1888 1045.2434 1070.2335 1081.3672 1107.3027 1114.9112 1145.8603 1156.0897 1180.8045 1188.6383 1222.3490 1241.2609 1267.4649 1276.0814 1284.4044 1294.3131 1313.9069 1326.3149 1330.1799 1345.8648 1357.5660 1364.6415 1375.1967 1383.5091 1430.8951 1433.9051 1474.5415 1480.7619 1483.2706 1489.7741 1539.7984 1582.1068 1638.0078 2848.5724 2918.4102 2930.1421 2989.6938 2993.1002 3020.1672 3046.4219 3094.8416 3173.0430 3260.8534 3376.1894 3535.8607 3689.8746
redmass: 6.0850 4.8881 5.3136 5.5238 6.3803 3.1400 6.2968 3.7655 5.2417 4.5121 6.5786 3.9608 4.9121 4.6562 6.2693 3.7180 3.1024 8.7791 1.5701 2.6467 1.2854 2.2055 3.9348 1.1283 7.8158 4.5151 4.5907 9.4061 7.5067 8.3380 5.6924 1.4680 5.1825 2.8658 3.9308 1.2345 1.4215 1.2553 2.6045 4.8644 6.6286 4.8233 4.6837 3.8515 2.5210 2.2368 2.7885 2.9554 1.3991 1.5798 1.3037 2.6624 1.4440 2.0711 1.2105 1.9404 2.5656 1.6048 1.3345 2.4296 1.4299 1.4396 1.3955 1.8895 7.2242 1.1811 3.0060 3.6165 1.3143 1.0939 1.1232 8.3373 1.8069 2.8611 1.0700 1.0714 1.0812 1.0843 1.0680 1.0816 1.0937 1.1019 1.0927 1.0991 1.0673 1.0445 1.1056
irintensity: 0.2554 0.9560 6.1865 0.1460 10.2463 5.6895 4.3846 0.3194 9.5396 4.0426 1.8050 3.7878 6.7667 5.2526 2.2029 11.0308 4.0214 9.1377 184.0370 51.3463 0.1140 20.2312 5.2103 118.3195 4.6647 7.3878 45.0457 18.0148 23.0502 5.4558 24.5487 12.6897 19.3070 0.6009 8.0064 93.1534 0.6321 32.6032 40.5117 99.9168 89.8004 23.5992 4.0584 17.9141 16.6621 55.2201 9.3804 7.6617 40.8104 42.8299 14.4756 29.4743 8.2365 87.9501 16.1512 91.2197 22.3170 3.7315 8.7910 29.9000 44.1046 2.2541 24.2274 40.0479 18.5198 100.3189 31.5490 37.2717 226.7536 6.5631 17.4649 40.2332 27.7685 633.3076 1187.9721 49.1212 87.8745 33.9554 36.1749 37.6530 46.2626 33.7723 9.2058 4.6800 120.3328 144.8473 54.6266
temp: 298.150 k
press: 1.00000 atm
elementType: 8 8 8 7 7 7 7 7 6 6 6 6 6 6 6 6 6 6 1 1 1 1 1 1 1 1 1 1 1 1 1
symmnumber: 1
zpe: 632314.3 jmol-1
zpe.correction: 0.240836 hartree
zpe.thermalcorrener: 0.256002 hartree
zpe.thermalcorrenthalpy: 0.256947 hartree
zpe.thermalcorrgfe: 0.198129 hartree
zpe.sumelectzpe: -886.950812 hartree
zpe.sumelectthermal: -886.935646 hartree
zpe.sumelectthermalent: -886.934701 hartree
zpe.sumelectthermalfe: -886.993519 hartree
dipole: -3.1408 2.8861 0.8492
dipole: 4.3492
quadrupole: -99.2532 -114.7931 -105.0363
quadrupole: 14.1871 -1.7205 1.2014
quadrupole: 7.1077 -8.4322 1.3245 14.1871 -1.7205 1.2014
hfenergy: -887.191648 hartree
pointgroup: C01 [X(C10H13N5O3)]
dipole: -1.1639172 1.2516005 0.0814086 debye
polarizability: 206.8136725|2.009512|154.5622864|-19.5570084|-12.2673775|90.6111087 unknown
InChI: InChI=1S/C10H13N5O3/c11-8-6-9(13-3-12-8)15(4-14-6)10-7(17)5(1-16)2-18-10/h3-5,7,10,16-17H,1-2,11H2
charge 0 multiplicity 1
31 atoms
O  1.976828 1.86404 -1.001355
O  1.705378 -1.756353 -0.32368
O  4.343476 -2.018541 0.707463
N  -0.181274 0.928325 -0.543556
N  -2.137032 2.063053 -0.147749
N  -0.927603 -1.373907 0.066788
N  -3.272722 -1.424446 0.774385
N  -4.630168 0.505015 0.861369
C  3.406035 0.039299 -0.278208
C  1.932011 -0.353347 -0.050973
C  1.193986 0.628606 -1.001082
C  3.302543 1.573841 -0.339033
C  4.322503 -0.559937 0.804833
C  -1.104216 -0.025172 -0.110722
C  -0.855959 2.161869 -0.55383
C  -2.304913 0.693561 0.128431
C  -3.419944 -0.065477 0.591751
C  -2.064736 -1.994693 0.510207
H  3.71696 -0.36416 -1.261234
H  1.64128 -0.09736 0.994682
H  1.147477 0.209994 -2.026809
H  3.294976 2.033327 0.669141
H  4.076075 2.052254 -0.959762
H  3.972662 -0.22997 1.810371
H  5.368394 -0.228027 0.677283
H  0.697204 -1.910978 -0.16907
H  -0.3501 3.076589 -0.848954
H  3.427152 -2.32024 0.438839
H  -1.996209 -3.073802 0.672294
H  -4.758558 1.507072 0.733796
H  -5.393308 -0.084133 1.189184
