program: Gaussian 09
title: 000267653
version: EM64L-G09RevD.01
frameworkgroup: C1[X(C15H16N6O3)]
method: RPBEPBE
basis: SDD
operation: Freq
keyword: #p
keyword: freq=noraman
keyword: PBEPBE/SDD
title: #p freq=noraman PBEPBE/SDD
converged: YES YES NO NO
title: Mulliken charges:
elementType: O O O N N N N N N C C C C C C C C C C C C C C C H H H H H H H H H H H H H H H H
charge: -0.224366 -0.456347 -0.276799 -0.423035 -0.040212 -0.374786 -0.446822 -0.035410 -0.622948 -0.504048 0.215565 -0.480211 -0.445214 0.352619 -0.118682 0.455569 -0.017956 0.155347 -0.422165 -0.352492 -0.344056 -0.341946 0.257001 0.091168 0.214326 0.250152 0.244773 0.235600 0.217005 0.248243 0.308227 0.348374 0.304721 0.236471 0.222832 0.265059 0.265169 0.308641 0.356506 0.374127
chargesum: 0.00000
title: Mulliken charges with hydrogens summed into heavy atoms:
elementType: O O O N N N N N N C C C C C C C C C C C C C C C
charge: -0.224366 -0.082221 -0.276799 -0.114807 -0.040212 -0.026412 -0.142101 -0.035410 0.042198 -0.039571 0.215565 0.000163 0.020035 0.352619 -0.118682 0.455569 -0.017956 0.155347 -0.185694 -0.129660 -0.078997 -0.076777 0.257001 0.091168
polarizability: 3.06948177e+02 1.00191697e+01 2.28223727e+02 -1.62805614e+01 -5.75381424e+00 1.76215556e+02
1716.lowfreq: -8.0399 -0.0006 -0.0005 0.0004 1.7145 4.8286 13.4355 21.0691 32.1807
frequency: 13.3036 20.9830 32.1719 39.3070 70.6035 86.5254 90.3524 105.4956 116.7895 150.8298 172.2045 195.4177 204.8194 215.6507 248.1564 269.8418 290.1066 295.2776 313.3005 325.7745 347.4571 360.3763 397.8125 418.1330 452.3086 471.1075 481.3057 491.9011 493.7014 501.4807 513.5398 544.7003 556.1363 567.1885 571.2361 599.7212 627.7863 631.5132 645.8847 652.0301 656.1216 683.4912 690.4218 703.9854 755.2302 759.9193 781.9479 817.6491 820.1452 827.5942 844.0649 885.6742 920.4856 953.4490 970.2639 975.2776 983.7784 985.2745 1000.2940 1008.2057 1036.9746 1054.8582 1093.6045 1122.7356 1138.7159 1153.3008 1166.9043 1182.3559 1193.4036 1200.6900 1239.9125 1253.1917 1269.7039 1298.5779 1300.0678 1314.5947 1317.8938 1326.8526 1344.5769 1366.5413 1368.3358 1383.7546 1422.3993 1437.5091 1452.3876 1462.5846 1478.7704 1486.8575 1508.1698 1531.7899 1567.9821 1576.8470 1597.2380 1601.8991 1607.4817 1628.9930 1640.4466 1650.2304 2925.9016 2948.4389 2991.5999 3022.5538 3059.7839 3079.1288 3127.3239 3142.6549 3158.2158 3171.0565 3491.9039 3519.1019 3534.5513 3544.0694 3544.6933 3695.0122
redmass: 6.9222 8.3817 5.6924 5.6879 6.1486 4.9690 5.2375 5.8353 2.8904 4.2012 5.3340 5.8448 5.9418 1.8520 1.1916 4.2638 2.2973 2.8671 4.8554 4.1602 5.9195 2.8993 4.2396 3.0362 4.6642 3.4897 4.6060 3.0298 2.7432 1.6583 2.8384 1.3365 3.9992 2.7385 1.4027 4.5083 6.7118 5.9681 2.8086 2.5157 3.5498 3.7007 8.6986 2.8930 4.7164 9.9601 3.5552 3.0963 1.4920 5.0049 1.7230 2.7593 3.1740 2.1661 1.6224 1.7191 2.6274 1.7354 2.7136 2.8694 2.4085 2.8577 2.8796 1.8129 1.9936 1.5119 2.6213 2.1508 1.9750 1.2252 1.3518 1.3785 1.8987 2.3283 1.4673 1.3208 2.0788 2.4413 1.8647 1.8818 1.8075 2.4648 3.7124 1.1102 4.3131 1.1933 1.1267 1.7009 2.7302 3.6886 4.1235 4.2540 1.5037 8.0743 6.1041 6.6152 7.5492 3.4100 1.0699 1.0602 1.0961 1.0625 1.0920 1.1040 1.0887 1.0874 1.0957 1.0959 1.0767 1.0775 1.0640 1.0753 1.0482 1.1046
irintensity: 6.4315 12.1913 1.6466 0.6824 1.2203 4.1936 0.8475 1.4802 3.7615 8.6408 6.6848 3.7389 1.3550 37.1041 63.8686 31.5172 109.4261 3.4962 2.0753 3.7778 8.2915 13.2072 0.5096 2.7837 1.5664 10.0241 20.8835 44.6409 63.9829 195.7303 50.2085 119.1777 16.5351 37.0328 78.3281 8.9017 2.4621 5.6967 45.3887 53.9471 10.0127 64.6892 18.4190 26.0726 17.6614 8.6392 6.4701 9.8486 3.9996 2.3678 75.3355 10.1061 7.4876 3.5924 9.4084 6.5256 125.5303 58.2386 101.1618 192.5991 28.1753 4.3260 1.6430 11.8269 11.1600 268.0322 22.8193 14.6739 30.6290 10.3616 4.3992 11.1223 2.4041 80.0388 12.1299 40.5217 52.0444 209.5833 27.9360 56.0608 36.0040 7.8579 141.7518 16.3205 2.2076 25.1028 18.1688 113.5239 152.1938 293.0793 9.5369 223.4311 7.6500 443.9273 82.0607 878.1507 101.7323 498.5780 61.3158 39.5183 13.4672 61.1114 16.1050 21.3912 7.1337 16.6351 7.0584 6.3175 222.4017 13.7980 43.5148 27.9930 103.9803 42.5675
temp: 298.150 k
press: 1.00000 atm
elementType: 8 8 8 7 7 7 7 7 7 6 6 6 6 6 6 6 6 6 6 6 6 6 6 6 1 1 1 1 1 1 1 1 1 1 1 1 1 1 1 1
symmnumber: 1
zpe: 803535.4 jmol-1
zpe.correction: 0.306050 hartree
zpe.thermalcorrener: 0.327910 hartree
zpe.thermalcorrenthalpy: 0.328854 hartree
zpe.thermalcorrgfe: 0.252764 hartree
zpe.sumelectzpe: -1133.667131 hartree
zpe.sumelectthermal: -1133.645271 hartree
zpe.sumelectthermalent: -1133.644327 hartree
zpe.sumelectthermalfe: -1133.720417 hartree
dipole: -8.6566 4.8491 -10.1422
dipole: 14.1885
quadrupole: -129.0380 -128.5435 -138.2191
quadrupole: 20.9828 36.8389 5.0287
quadrupole: 2.8955 3.3900 -6.2855 20.9828 36.8389 5.0287
hfenergy: -1133.9731811 hartree
pointgroup: C01 [X(C15H16N6O3)]
dipole: -3.9848069 -3.2528458 2.1682467 debye
polarizability: 297.9567093|-22.0912516|225.0115147|31.408001|12.1059071|188.4192363 unknown
InChI: InChI=1S/C15H16N6O3/c16-15-20-12-11(13(22)21-15)19-10(7-18-12)5-6-17-9-3-1-8(2-4-9)14(23)24/h1-4,17-18,20,23H,5-7,16H2
charge 0 multiplicity 1
40 atoms
O  -2.483055 1.857131 -2.560617
O  6.401614 -0.50005 2.2081
O  5.772254 1.713275 2.529853
N  -3.304656 -1.750337 0.553733
N  -1.580806 -0.612426 -1.348966
N  1.268706 -0.40584 -1.683773
N  -4.624291 0.252215 0.56799
N  -4.189601 2.069412 -0.961712
N  -5.905488 2.243748 0.625724
C  -0.036882 -2.521343 -1.251149
C  -1.364805 -1.848829 -0.969906
C  -2.459551 -2.66269 -0.249412
C  0.855823 -1.702197 -2.223294
C  -3.572194 -0.494191 0.029386
C  -2.787184 0.034541 -0.997994
C  2.315173 -0.206929 -0.798832
C  -3.116485 1.354828 -1.590879
C  -4.866762 1.541268 0.038336
C  2.490005 1.088411 -0.205201
C  3.249491 -1.238686 -0.456157
C  3.541574 1.333323 0.681723
C  4.304365 -0.979211 0.431469
C  4.468971 0.304248 1.019568
C  5.554697 0.6092 1.961323
H  -0.220565 -3.53201 -1.676465
H  0.506975 -2.686922 -0.296766
H  -3.075857 -3.202875 -1.001968
H  -2.008484 -3.420056 0.414385
H  1.743888 -2.295995 -2.502817
H  0.283788 -1.508733 -3.147375
H  -3.468528 -1.946464 1.542154
H  0.531424 0.305242 -1.737296
H  -5.312026 -0.205218 1.170746
H  1.78756 1.889883 -0.463561
H  3.151713 -2.23913 -0.889318
H  3.672987 2.322711 1.132774
H  5.015891 -1.770463 0.685882
H  -6.303523 1.999161 1.529053
H  -6.098039 3.16059 0.227472
H  7.10429 -0.20279 2.845493
