program: Gaussian 09
title: 000022768
version: EM64L-G09RevD.01
frameworkgroup: C1[X(C22H21NO)]
method: RPBEPBE
basis: SDD
operation: Freq
keyword: #p
keyword: freq=noraman
keyword: PBEPBE/SDD
title: #p freq=noraman PBEPBE/SDD
converged: YES YES NO NO
title: Mulliken charges:
elementType: O N C C C C C C C C C C C C C C C C C C C C C C H H H H H H H H H H H H H H H H H H H H H
charge: -0.204040 -0.338665 -0.301117 -0.372549 -0.583708 0.453781 0.107535 0.498236 0.305279 -0.451819 -0.366192 -0.398988 -0.427375 -0.230335 -0.226794 -0.332676 -0.354435 -0.241828 -0.231911 -0.226035 -0.253170 -0.231918 -0.244362 -0.226093 0.209851 0.251008 0.196462 0.261524 0.236395 0.191263 0.228200 0.278302 0.241535 0.228811 0.226592 0.227467 0.227813 0.277247 0.229570 0.223488 0.222023 0.229847 0.232797 0.225974 0.233007
chargesum: 0.00000
title: Mulliken charges with hydrogens summed into heavy atoms:
elementType: O N C C C C C C C C C C C C C C C C C C C C C C
charge: -0.204040 -0.077140 -0.091266 0.074921 -0.156050 0.453781 0.107535 0.498236 0.305279 -0.223619 -0.087890 -0.157452 -0.198564 -0.003743 0.000673 -0.104862 -0.077188 -0.012258 -0.008424 -0.004012 -0.023323 0.000878 -0.018388 0.006914
polarizability: 2.75764014e+02 1.76845054e+01 2.40478026e+02 -8.66602968e+00 -1.47490778e+01 2.09832228e+02
1716.lowfreq: -14.5768 -5.1028 -3.9375 -0.0005 0.0007 0.0007 10.1830 13.5740 19.0676
frequency: 9.5782 12.0659 19.0504 21.6265 34.0398 38.8096 55.7806 71.4917 107.8644 124.9257 150.7812 161.2255 204.5789 209.0585 245.6364 276.5987 326.2091 339.7778 355.4497 397.9293 403.6009 404.3310 413.8812 429.1213 463.4959 503.7806 508.0890 563.6007 570.6845 609.0804 613.0476 614.5491 617.8229 667.2092 682.6507 693.8658 704.9356 705.6454 758.6589 768.5021 769.5000 797.9235 815.7277 843.7966 848.2829 852.0799 854.0914 858.0033 917.3583 926.2739 940.6946 948.1838 975.7509 978.2641 988.1041 989.6403 989.8990 991.1370 992.8792 997.3254 1010.2902 1015.3877 1024.9389 1025.9616 1027.2899 1040.2446 1068.3409 1081.1563 1085.3547 1099.4815 1158.5098 1170.6707 1171.9840 1172.9935 1174.8233 1184.7481 1185.2691 1185.4189 1196.5192 1215.1293 1222.6286 1236.3515 1278.9844 1290.8129 1312.2431 1324.2803 1326.2480 1336.6360 1368.6905 1382.4143 1385.3709 1385.8569 1433.8539 1439.5408 1439.9339 1456.1294 1475.5271 1477.4507 1480.1886 1484.1045 1491.1282 1567.6937 1592.3856 1592.9163 1596.6693 1608.1773 1613.0939 1614.4612 2845.1141 2861.5542 2978.0057 3035.8323 3054.7313 3109.4996 3113.6379 3116.2542 3127.0601 3128.3077 3130.5673 3139.1963 3139.8880 3142.2113 3151.4351 3152.9826 3160.6821 3163.3953 3164.7076 3172.8780 3466.1110
redmass: 3.7004 4.7186 4.4724 4.4609 4.9523 3.3079 4.0441 5.6670 4.5309 3.7226 4.4566 4.3127 4.4544 4.6268 4.6002 3.7493 2.8245 6.5338 3.1768 2.7747 2.8252 2.8848 4.5672 3.8743 5.6732 3.5080 2.2888 2.0833 4.4847 3.9605 6.3162 6.3906 6.3565 5.0799 5.6975 1.6032 1.7717 1.7060 1.9155 2.1547 1.9569 1.2384 3.6314 4.0508 2.0260 1.6574 1.2570 1.2951 1.4434 1.4842 1.4631 5.1946 1.3857 1.3899 1.4109 5.8222 6.1750 5.7798 1.3186 1.3332 1.3433 1.8776 2.2297 2.2071 2.0529 2.9749 2.2909 1.6547 1.5833 1.7179 3.4972 1.0722 1.0821 1.0859 1.1538 1.1940 1.3318 1.1122 1.5529 2.3372 2.8081 1.8439 1.1701 1.5142 1.3764 1.3062 1.2605 1.3082 1.4569 7.3480 7.8936 6.6764 2.2318 2.1326 2.1537 1.2684 1.2269 1.9108 2.2373 2.1662 1.1047 7.1495 6.2273 6.0730 6.6038 6.0452 6.6471 6.1957 1.0794 1.0716 1.0629 1.0878 1.0984 1.0881 1.0863 1.0870 1.0862 1.0852 1.0911 1.0916 1.0888 1.0960 1.0956 1.0931 1.1015 1.0961 1.1012 1.0989 1.0753
irintensity: 0.1568 0.3897 0.1683 0.6135 0.8404 0.4641 0.1795 0.4613 3.0029 0.7309 0.2463 1.3150 2.4778 1.3143 1.3802 0.2168 1.4752 2.2061 3.8831 0.2586 0.0128 0.4404 1.5358 0.1939 1.2200 17.0529 55.0772 54.6115 14.1401 18.7208 0.4482 0.2339 0.1249 7.5183 4.2006 64.7204 16.1396 104.1440 47.0175 23.7385 44.4845 2.9775 2.6651 11.5546 3.3838 0.2152 0.1294 0.7444 1.2968 0.2754 6.0868 90.3435 0.0872 0.3118 0.4486 1.2180 0.0699 1.2184 0.3233 0.7404 0.7819 0.8559 14.5749 1.2562 2.1945 6.4321 12.3816 1.2490 4.5824 16.2597 138.3736 0.9079 3.1074 2.3302 8.5435 16.3587 13.8470 0.1347 4.6680 9.5010 75.1699 53.8089 25.1292 11.8670 7.4727 11.1608 0.2903 16.5451 1.1189 0.0255 1.2340 1.3289 17.0715 1.9478 13.3267 35.2880 5.4256 0.9854 24.1332 14.6151 4.4580 85.8623 5.6146 1.0600 31.5750 9.6989 5.1142 11.5211 65.6288 108.4381 32.5083 10.1872 24.9145 11.8302 9.6085 4.3084 0.4028 0.0771 13.7782 21.3078 10.3839 45.8071 19.7441 15.9026 26.8321 33.8146 21.2630 11.4204 0.3583
temp: 298.150 k
press: 1.00000 atm
elementType: 8 7 6 6 6 6 6 6 6 6 6 6 6 6 6 6 6 6 6 6 6 6 6 6 1 1 1 1 1 1 1 1 1 1 1 1 1 1 1 1 1 1 1 1 1
symmnumber: 1
zpe: 962971.6 jmol-1
zpe.correction: 0.366777 hartree
zpe.thermalcorrener: 0.388097 hartree
zpe.thermalcorrenthalpy: 0.389041 hartree
zpe.thermalcorrgfe: 0.310148 hartree
zpe.sumelectzpe: -979.212865 hartree
zpe.sumelectthermal: -979.191545 hartree
zpe.sumelectthermalent: -979.190601 hartree
zpe.sumelectthermalfe: -979.269494 hartree
dipole: -2.3004 -0.0910 2.8638
dipole: 3.6745
quadrupole: -130.6396 -129.6441 -134.4568
quadrupole: -0.2341 -1.3577 -3.4045
quadrupole: 0.9406 1.9361 -2.8767 -0.2341 -1.3577 -3.4045
hfenergy: -979.5796418 hartree
pointgroup: C01 [X(C22H21N1O1)]
dipole: 0.7958735 -0.531069 1.083718 debye
polarizability: 281.8396026|-4.5206893|229.1101837|16.2559363|13.0924766|215.1244819 unknown
InChI: InChI=1S/C22H21NO/c24-22(20-14-8-3-9-15-20)21(19-12-6-2-7-13-19)23-17-16-18-10-4-1-5-11-18/h1-15,21,23H,16-17H2
charge 0 multiplicity 1
45 atoms
O  0.052834 -0.688278 -1.77217
N  0.00081 1.286879 0.166856
C  0.877426 0.129476 0.393603
C  -1.446948 1.080523 0.355747
C  -2.219489 2.382062 0.025481
C  2.33941 0.59119 0.345697
C  0.646569 -0.968243 -0.693114
C  -3.723698 2.201354 0.162303
C  1.155717 -2.363926 -0.447102
C  3.16795 0.533101 1.491826
C  2.857162 1.129465 -0.860209
C  -4.46794 1.572756 -0.870513
C  -4.410431 2.617559 1.331347
C  4.501814 0.99814 1.436161
C  4.189411 1.59238 -0.916876
C  1.760462 -2.782487 0.769735
C  1.014415 -3.308332 -1.501985
C  5.016691 1.525644 0.229653
C  -5.85893 1.365294 -0.738712
C  -5.80272 2.412197 1.468662
C  2.209872 -4.111281 0.924718
C  1.464545 -4.633231 -1.348016
C  -6.532204 1.784071 0.433233
C  2.064131 -5.040229 -0.131323
H  0.694076 -0.349882 1.388887
H  -1.777313 0.285195 -0.335815
H  -1.709224 0.749317 1.392335
H  0.356672 2.126741 0.638984
H  -1.946791 2.674879 -1.005329
H  -1.872164 3.190946 0.699819
H  2.767915 0.136264 2.434016
H  2.204446 1.186528 -1.738182
H  -3.951745 1.249865 -1.783439
H  -3.850763 3.110464 2.136575
H  5.134562 0.952501 2.32966
H  4.583956 2.004093 -1.852647
H  1.886702 -2.082163 1.599966
H  0.545607 -2.970929 -2.432289
H  6.051229 1.884078 0.18391
H  -6.417894 0.882068 -1.548369
H  -6.317176 2.743969 2.378009
H  2.673488 -4.42263 1.867141
H  1.350484 -5.349255 -2.169224
H  -7.611829 1.626151 0.535804
H  2.413902 -6.071385 -0.007912
