program: Gaussian 09
title: 000267665
version: EM64L-G09RevD.01
frameworkgroup: C1[X(C22H24N2O2)]
method: RPBEPBE
basis: SDD
operation: Freq
keyword: #p
keyword: freq=noraman
keyword: PBEPBE/SDD
title: #p freq=noraman PBEPBE/SDD
converged: YES YES NO NO
title: Mulliken charges:
elementType: O O N N C C C C C C C C C C C C C C C C C C C C C C H H H H H H H H H H H H H H H H H H H H H H H H
charge: -0.290416 -0.290414 -0.388888 -0.388885 -0.357279 -0.357289 -0.397840 -0.397852 0.241415 0.241416 -0.378673 -0.378675 -0.237418 -0.237419 0.472370 0.472369 -0.370924 -0.370926 -0.386420 -0.386420 -0.234853 -0.234852 -0.234517 -0.234516 -0.235995 -0.235997 0.222918 0.195215 0.195220 0.222915 0.257652 0.207500 0.207501 0.257658 0.295672 0.295673 0.206058 0.206057 0.264458 0.264457 0.224379 0.224380 0.236532 0.236532 0.227788 0.227787 0.229762 0.229761 0.231512 0.231512
chargesum: 0.00000
title: Mulliken charges with hydrogens summed into heavy atoms:
elementType: O O N N C C C C C C C C C C C C C C C C C C C C C C
charge: -0.290416 -0.290414 -0.093216 -0.093212 0.060853 0.060846 0.067311 0.067307 0.241415 0.241416 -0.172615 -0.172617 0.027040 0.027039 0.472370 0.472369 -0.146545 -0.146546 -0.149888 -0.149887 -0.007065 -0.007065 -0.004755 -0.004755 -0.004484 -0.004485
polarizability: 2.08027717e+02 -3.13703717e-02 4.13369365e+02 6.53833085e+00 4.17521829e-03 2.41103461e+02
1716.lowfreq: -9.6571 -3.7615 -2.2105 -0.0009 -0.0004 -0.0001 1.6489 5.1945 10.8348
frequency: -9.3532 0.6156 10.7531 22.3828 23.2923 32.6771 38.4649 72.9277 73.0503 92.2182 93.7843 102.0691 124.5825 163.3910 167.4564 199.1044 205.4149 228.9060 250.9271 263.7703 267.8989 278.7427 280.2088 330.5608 372.4782 403.2506 403.2702 425.7649 484.7720 490.2898 499.8317 510.2651 523.9466 529.4899 556.2194 566.9947 569.3183 615.8696 615.8891 678.4226 680.3096 687.2407 694.5551 701.2467 701.4607 755.9736 774.5646 775.2615 808.0265 822.9898 845.5371 847.3215 847.5219 865.2625 875.0266 875.7422 921.6136 925.1699 925.2131 944.1821 978.7002 978.7173 980.6424 988.3900 988.8731 995.5993 995.6482 1003.4733 1011.9007 1012.4229 1025.8682 1026.5752 1075.5018 1083.1825 1083.2337 1096.0240 1100.1105 1103.2281 1173.4644 1173.4882 1178.1889 1187.1894 1190.5761 1191.1276 1195.6076 1216.7152 1216.8862 1235.8386 1285.4238 1286.8610 1293.9989 1294.7977 1318.6900 1324.0964 1325.1954 1334.6877 1334.7326 1349.6081 1360.4816 1373.8479 1386.0365 1386.1505 1440.2693 1440.2849 1444.7773 1445.6964 1453.8206 1466.5511 1479.9618 1481.8743 1487.5111 1489.3370 1582.4720 1582.6103 1583.2923 1584.0130 1611.4002 1611.4102 1655.1925 1655.7979 2970.4067 2974.1060 2991.5568 2992.2799 3026.2370 3049.9367 3075.0293 3075.0937 3096.6115 3096.6191 3105.9866 3106.0582 3123.8150 3123.8181 3127.9495 3127.9518 3140.4066 3140.4161 3150.9853 3151.0284 3166.8668 3166.9035 3555.2726 3555.2874
redmass: 4.0111 6.4192 4.3658 4.8953 7.1302 6.3869 4.6117 4.1605 4.2533 3.9899 5.5375 4.6759 2.4995 3.1460 2.5014 3.8941 4.3545 4.7208 3.7883 5.9616 2.9807 3.4393 3.4135 2.8336 2.7605 2.7582 2.7613 2.8628 2.3377 2.7795 3.9641 3.5862 1.4605 1.2989 2.1432 6.0545 4.0334 6.4137 6.4213 3.6120 3.7290 3.5758 3.8097 1.7596 1.7505 1.5688 2.0285 2.0251 2.9957 2.8154 3.1884 1.2959 1.2901 2.5992 1.8561 1.8608 3.1691 1.4447 1.4446 2.8106 1.3855 1.3853 2.4073 5.9582 6.1371 1.3091 1.3097 2.5740 1.2296 1.2267 2.2101 2.1798 4.0714 1.6043 1.6046 3.2091 2.3344 2.4633 1.0655 1.0650 1.2554 1.6106 1.1455 1.1645 1.8253 1.6272 1.6588 1.3469 1.1677 1.2873 2.0011 1.8440 1.3172 1.5349 1.4036 1.2666 1.2679 1.4710 1.3131 1.3778 6.9518 6.6625 2.2821 2.2883 1.1494 1.1392 1.0865 1.0999 1.8026 1.9487 2.2261 2.1473 5.8046 5.6802 6.4798 6.5695 5.9675 5.9698 5.6189 5.6549 1.0609 1.0618 1.0656 1.0646 1.0946 1.1012 1.1001 1.0996 1.0919 1.0919 1.0883 1.0883 1.0857 1.0857 1.0869 1.0870 1.0916 1.0916 1.0964 1.0964 1.1016 1.1016 1.0776 1.0776
irintensity: 6.7173 0.0049 1.0129 0.2018 2.2148 1.0163 11.0906 1.1366 0.6082 1.4236 4.3061 0.2404 0.1204 0.8655 0.2216 3.4294 0.0080 2.7519 4.1740 6.9345 1.9700 0.2246 6.9908 7.2613 18.4115 0.2438 0.0248 12.1651 13.0317 80.4645 1.4786 4.5350 3.7861 197.4699 34.7151 3.8970 7.4115 0.1398 0.0998 0.0322 8.1811 2.0918 0.9123 81.8878 14.1197 19.3734 119.8965 23.3918 9.0066 0.0370 0.0192 0.2043 1.4281 5.1935 34.3742 5.0330 2.1029 0.0062 0.0013 2.3218 0.8227 0.1676 7.8885 1.9698 0.2395 11.4555 1.8325 5.9652 72.1842 11.8331 2.8067 6.3499 5.6245 1.9636 20.1783 5.7384 13.8424 2.6082 0.0812 0.0770 0.7622 58.2480 1.4461 14.9478 201.2891 9.0342 43.3165 37.2040 1.7191 52.6922 12.0978 55.5468 1.5223 82.5990 47.6770 2.8940 11.8120 4.2644 3.4674 1.5970 3.8119 15.7524 4.0043 23.7092 94.3800 0.0730 1.9115 19.1064 82.7673 91.9400 67.9870 318.3867 9.1262 39.6846 81.3493 212.5507 0.7991 1.1847 49.0044 122.8184 16.0148 58.3211 7.3714 91.5932 3.5688 125.0057 1.2497 10.6351 0.8797 0.0366 3.2143 27.1542 4.9893 5.7905 0.3363 1.3104 6.4186 9.9722 9.5323 70.8762 13.3767 40.9378 20.8676 18.2076
temp: 298.150 k
press: 1.00000 atm
elementType: 8 8 7 7 6 6 6 6 6 6 6 6 6 6 6 6 6 6 6 6 6 6 6 6 6 6 1 1 1 1 1 1 1 1 1 1 1 1 1 1 1 1 1 1 1 1 1 1 1 1
symmnumber: 1
zpe: 1074080.1 jmol-1
zpe.correction: 0.409095 hartree
zpe.thermalcorrener: 0.433428 hartree
zpe.thermalcorrenthalpy: 0.434372 hartree
zpe.thermalcorrgfe: 0.346480 hartree
zpe.sumelectzpe: -1110.825177 hartree
zpe.sumelectthermal: -1110.800844 hartree
zpe.sumelectthermalent: -1110.799900 hartree
zpe.sumelectthermalfe: -1110.887793 hartree
dipole: 0.0004 -0.9273 0.0000
dipole: 0.9273
quadrupole: -159.3653 -124.5079 -151.7337
quadrupole: -0.0033 -21.1083 -0.0002
quadrupole: -14.1630 20.6944 -6.5313 -0.0033 -21.1083 -0.0002
hfenergy: -1111.2342723 hartree
pointgroup: C01 [X(C22H24N2O2)]
dipole: -0.0003096 0.3648082 -0.0000584 debye
polarizability: 207.0831364|-0.1274922|413.3692872|-3.2576261|-0.0280529|242.0481201 unknown
InChI: InChI=1S/C22H24N2O2/c25-21(15-13-19-9-3-1-4-10-19)23-17-7-8-18-24-22(26)16-14-20-11-5-2-6-12-20/h1-6,9-16,23-24H,7-8,17-18H2
charge 0 multiplicity 1
50 atoms
O  2.784236 -2.177529 -2.26345
O  -2.781492 -2.179723 2.264034
N  2.425581 -3.101745 -0.15322
N  -2.42178 -3.1041 0.154055
C  0.321205 -4.380191 -0.702382
C  -0.316221 -4.380424 0.703588
C  1.870035 -4.356251 -0.682778
C  -1.865076 -4.357958 0.683933
C  2.840055 -2.070698 -0.994237
C  -2.837174 -2.073194 0.994791
C  3.350699 -0.85989 -0.289677
C  -3.349299 -0.863206 0.289899
C  3.802148 0.214259 -1.003046
C  -3.80218 0.210537 1.002972
C  4.332913 1.483251 -0.484327
C  -4.334493 1.478738 0.483908
C  4.445933 1.776336 0.906668
C  -4.447641 1.771404 -0.907165
C  4.755781 2.47423 -1.416599
C  -4.758802 2.469359 1.415907
C  4.961287 3.011994 1.342798
C  -4.964506 3.006312 -1.34363
C  5.272419 3.712232 -0.980723
C  -5.276958 3.706606 0.979695
C  5.377596 3.986822 0.402212
C  -5.382241 3.980789 -0.403313
H  -0.024299 -3.503427 -1.283699
H  -0.00285 -5.286297 -1.255266
H  0.00868 -5.286167 1.256569
H  0.02843 -3.503275 1.284833
H  2.253777 -4.456654 -1.712801
H  2.254991 -5.202478 -0.080628
H  -2.249206 -5.204682 0.081954
H  -2.248765 -4.458504 1.713962
H  2.460766 -2.961797 0.857474
H  -2.457139 -2.964472 -0.856678
H  3.348144 -0.863354 0.808952
H  -3.346655 -0.866938 -0.808729
H  3.758098 0.106026 -2.09728
H  -3.758102 0.102617 2.097236
H  4.127669 1.035839 1.649012
H  -4.128281 1.031177 -1.649307
H  4.674814 2.262732 -2.489859
H  -4.677753 2.258177 2.489223
H  5.0399 3.221405 2.415494
H  -5.043193 3.215412 -2.416382
H  5.591529 4.460067 -1.71494
H  -5.597162 4.454174 1.71371
H  5.777805 4.947139 0.745666
H  -5.783621 4.940522 -0.747029
