program: Gaussian 09
title: 000267634
version: EM64L-G09RevD.01
frameworkgroup: C1[X(C15H23NO4S)]
method: RPBEPBE
basis: SDD
operation: Freq
keyword: #p
keyword: freq=noraman
keyword: PBEPBE/SDD
title: #p freq=noraman PBEPBE/SDD
converged: NO YES NO NO
title: Mulliken charges:
elementType: S O O O O N C C C C C C C C C C C C C C C H H H H H H H H H H H H H H H H H H H H H H H
charge: 0.896468 -0.302838 -0.562804 -0.557748 -0.263992 -0.465452 -0.361733 -0.351889 -0.374647 -0.354284 -0.308400 -0.087596 -0.693665 -0.506245 -0.235268 -0.246114 0.500898 -0.432092 -0.334580 -0.635585 0.260239 0.187800 0.197442 0.189699 0.195360 0.232004 0.207976 0.194502 0.197033 0.226525 0.234755 0.259257 0.257677 0.211939 0.209990 0.217148 0.290550 0.283699 0.236845 0.310682 0.255901 0.256636 0.228212 0.335694
chargesum: 0.00000
title: Mulliken charges with hydrogens summed into heavy atoms:
elementType: S O O O O N C C C C C C C C C C C C C C C
charge: 0.896468 -0.302838 -0.562804 -0.557748 -0.263992 -0.129758 0.023510 0.033171 0.065332 0.037251 0.152879 -0.087596 -0.054589 0.010689 0.055282 0.037585 0.500898 -0.195247 -0.023898 0.105164 0.260239
polarizability: 3.37001832e+02 -1.54013590e+01 1.78443763e+02 -6.21739955e+00 -1.89878445e+01 1.58557760e+02
1716.lowfreq: -2.6678 -0.1645 -0.0018 -0.0018 -0.0015 8.6185 13.2263 17.4375 28.4397
frequency: 13.2074 17.4132 28.2529 39.1742 43.9674 53.4173 60.1849 75.2089 84.5176 92.0444 111.0939 118.9988 131.5838 148.5409 155.0716 180.6754 191.3207 227.2616 235.5164 244.3084 251.5597 259.3425 281.2507 316.0033 332.0016 357.4963 378.3201 379.6083 414.1748 418.8493 467.7712 501.3509 517.4994 555.6582 614.6941 648.6872 652.4860 676.9159 705.1102 722.6991 727.8062 750.4573 779.6873 788.2276 798.9759 822.8454 837.2907 863.2451 881.7523 888.3870 900.4284 908.9516 962.4904 974.1980 988.5358 990.3459 991.0083 999.7526 1011.3963 1040.9764 1044.3380 1056.3459 1065.5378 1066.7258 1081.6015 1119.9090 1121.5428 1163.0533 1170.1838 1183.8082 1205.5332 1236.0214 1237.6307 1248.9672 1256.3615 1263.9352 1284.8034 1292.1432 1294.8797 1297.4208 1298.3727 1340.6764 1355.9238 1367.9007 1382.1073 1390.4620 1394.1583 1407.1614 1410.1850 1452.3487 1463.3516 1464.7171 1466.1693 1474.4035 1475.4618 1477.9495 1482.5933 1483.0660 1489.3823 1513.6146 1598.2373 1601.9524 1663.3577 2955.1925 2959.3536 2969.2215 2972.9203 2990.8441 2992.1134 2993.6912 3008.7654 3021.7621 3032.8743 3044.1434 3054.7031 3069.6071 3072.9046 3086.5125 3101.5787 3102.2629 3128.6411 3138.8391 3151.9277 3158.0561 3191.9621 3540.4394
redmass: 4.7242 4.9456 2.4981 4.3230 4.5875 1.7443 3.3246 4.9598 4.6804 4.4400 3.3153 2.0637 2.3708 6.5156 4.7669 5.9305 1.5035 4.9830 1.1004 3.7374 2.3133 4.3470 3.4235 7.6219 6.4285 5.6921 4.6146 5.1750 2.9805 2.8659 5.1803 4.1160 4.0249 5.1384 6.8287 2.4179 2.1321 5.5572 4.4685 3.4923 1.0689 1.1007 1.2085 13.2685 1.2007 5.0687 1.3966 1.4414 1.8710 1.6109 3.0601 5.0610 1.3489 1.5643 2.4582 1.3396 1.8301 3.6355 3.8520 1.4047 3.5967 2.3958 2.8021 2.6618 2.2236 1.7862 1.7207 2.9788 2.0000 1.1268 1.4548 1.2485 1.2769 1.2627 1.2688 2.0411 1.0549 1.1866 1.1847 1.3314 1.1723 1.4175 1.6323 1.5711 3.1256 1.2157 1.1633 4.4855 1.1324 1.0912 1.0345 1.0673 1.0760 1.0829 2.1830 1.0427 1.0506 1.0806 1.0924 2.4176 6.0849 5.7766 7.6648 1.0588 1.0590 1.0594 1.0363 1.0656 1.0360 1.0914 1.1014 1.0582 1.1041 1.0569 1.1036 1.1008 1.0993 1.0975 1.1018 1.1084 1.0895 1.1099 1.0910 1.0958 1.0949 1.0762
irintensity: 0.3594 2.2296 0.1922 1.1975 3.7000 0.1178 0.1636 1.3132 2.4371 1.3241 1.7719 0.3014 0.2719 2.6642 1.1976 1.5506 0.0354 28.4486 0.1090 0.0774 1.4072 8.2651 14.3887 15.2959 18.7027 5.0900 1.1217 1.7048 0.0093 2.0719 44.6359 0.3595 36.9669 96.7805 0.5881 33.2753 16.4651 20.5105 50.9433 4.5320 12.6356 0.5943 1.7668 89.6308 2.1639 18.9981 34.4209 46.3867 1.1658 5.0377 3.8152 79.6759 0.8279 44.4173 26.2924 2.7545 12.3774 142.5016 89.4970 7.5548 84.5095 22.0659 23.3015 10.5826 0.3048 55.1881 12.4871 541.6335 60.1201 15.7590 3.2740 0.3830 10.8291 12.7609 6.0792 6.6855 1.2895 0.6372 7.2215 24.9254 3.0216 0.2473 1.0356 93.0219 134.5912 11.2490 29.8292 23.8315 1.7934 13.5028 19.6250 0.4055 0.6457 1.0585 2.1760 12.8313 13.2993 3.9803 22.8301 730.9507 88.6178 128.9645 180.4432 2.3056 6.6726 91.4387 36.8200 18.7944 20.0529 7.3055 0.5959 50.9702 36.9790 9.8119 33.4197 91.3997 55.0002 9.2606 3.5959 31.0346 11.8507 6.9147 1.5904 9.5564 5.2490 38.1483
temp: 298.150 k
press: 1.00000 atm
elementType: 16 8 8 8 8 7 6 6 6 6 6 6 6 6 6 6 6 6 6 6 6 1 1 1 1 1 1 1 1 1 1 1 1 1 1 1 1 1 1 1 1 1 1 1
symmnumber: 1
zpe: 942015.0 jmol-1
zpe.correction: 0.358795 hartree
zpe.thermalcorrener: 0.383129 hartree
zpe.thermalcorrenthalpy: 0.384073 hartree
zpe.thermalcorrgfe: 0.300279 hartree
zpe.sumelectzpe: -1337.340234 hartree
zpe.sumelectthermal: -1337.315900 hartree
zpe.sumelectthermalent: -1337.314956 hartree
zpe.sumelectthermalfe: -1337.398749 hartree
dipole: 4.5140 -5.2777 -2.6203
dipole: 7.4227
quadrupole: -131.7634 -137.1431 -137.9670
quadrupole: 14.3655 23.9164 -5.4759
quadrupole: 3.8611 -1.5186 -2.3425 14.3655 23.9164 -5.4759
hfenergy: -1337.6990289 hartree
pointgroup: C01 [X(C15H23N1O4S1)]
dipole: 1.7015496 0.609924 -2.2936932 debye
polarizability: 335.7349612|8.1504622|167.7745591|-21.2026476|20.7290574|170.4938347 unknown
InChI: InChI=1S/C15H23NO4S/c1-3-5-6-7-12-20-15(17)16-13-8-10-14(11-9-13)21(18,19)4-2/h8-11,16H,3-7,12H2,1-2H3
charge 0 multiplicity 1
44 atoms
S  -5.173183 -0.480781 0.741237
O  2.621444 -0.332128 -2.101858
O  -5.839377 -1.947579 0.430469
O  -5.081166 0.131579 2.25911
O  1.639485 1.092186 -0.498164
N  0.456977 -0.661183 -1.577673
C  6.130571 0.42648 -0.651762
C  6.972781 -0.162147 0.502954
C  4.737779 -0.2363 -0.772686
C  8.36881 0.489452 0.628578
C  3.92734 0.369605 -1.925122
C  -3.430163 -0.489555 0.009618
C  9.205213 -0.101822 1.783921
C  -6.165887 0.818575 -0.322907
C  -3.12648 -1.458868 -0.960951
C  -2.481729 0.418848 0.506507
C  -0.837662 -0.566862 -1.014033
C  -1.817596 -1.490945 -1.476558
C  -1.171231 0.388358 -0.012847
C  -7.592992 0.874721 0.211499
C  1.567771 0.129617 -1.300578
H  6.685505 0.305921 -1.605723
H  6.009025 1.518234 -0.493838
H  7.09205 -1.255396 0.352276
H  6.422737 -0.03739 1.458519
H  4.180035 -0.10374 0.173695
H  4.85485 -1.324537 -0.940686
H  8.916778 0.36498 -0.327838
H  8.248741 1.581818 0.778579
H  4.42913 0.229542 -2.896858
H  3.728133 1.442532 -1.750751
H  -5.596848 1.753164 -0.194104
H  -6.080606 0.434508 -1.351968
H  8.693535 0.036938 2.754953
H  9.366047 -1.187376 1.642465
H  10.197671 0.380102 1.853418
H  -3.886251 -2.1823 -1.274926
H  -2.752098 1.117065 1.305879
H  -1.551057 -2.238762 -2.233041
H  -0.40802 1.080961 0.346699
H  -8.0871 -0.108286 0.124891
H  -7.606066 1.185887 1.270282
H  -8.177239 1.609414 -0.372869
H  0.618642 -1.391826 -2.274606
