program: Gaussian 09
title: 000267666
version: EM64L-G09RevD.01
frameworkgroup: C1[X(C22H22Cl2N2O2)]
method: RPBEPBE
basis: SDD
operation: Freq
keyword: #p
keyword: freq=noraman
keyword: PBEPBE/SDD
title: #p freq=noraman PBEPBE/SDD
converged: YES YES NO NO
title: Mulliken charges:
elementType: Cl Cl O O N N C C C C C C C C C C C C C C C C C C C C C C H H H H H H H H H H H H H H H H H H H H H H
charge: -0.049752 -0.049753 -0.290083 -0.290083 -0.385468 -0.385465 -0.366145 -0.366151 -0.398393 -0.398398 0.244170 0.244169 -0.375418 -0.375420 -0.245956 -0.245955 0.501701 0.501701 -0.361606 -0.361603 -0.380413 -0.380413 -0.218375 -0.218377 -0.222176 -0.222176 -0.107103 -0.107102 0.196631 0.237937 0.196631 0.237937 0.254419 0.205845 0.205850 0.254420 0.297525 0.297526 0.205928 0.205930 0.268451 0.268451 0.230613 0.230613 0.243238 0.243237 0.256174 0.256174 0.258257 0.258257
chargesum: 0.00000
title: Mulliken charges with hydrogens summed into heavy atoms:
elementType: Cl Cl O O N N C C C C C C C C C C C C C C C C C C C C C C
charge: -0.049752 -0.049753 -0.290083 -0.290083 -0.087943 -0.087939 0.068423 0.068417 0.061871 0.061871 0.244170 0.244169 -0.169490 -0.169491 0.022495 0.022496 0.501701 0.501701 -0.130992 -0.130991 -0.137175 -0.137175 0.037799 0.037797 0.036080 0.036081 -0.107103 -0.107102
polarizability: 1.92769737e+02 4.63317667e-01 5.04678718e+02 -2.31356078e+01 3.41245060e-02 2.45818844e+02
1716.lowfreq: -7.0484 -4.4250 -0.0004 0.0006 0.0010 1.5906 3.6762 8.8479 10.6724
frequency: 3.3807 7.4819 9.0754 17.1725 20.8602 28.8880 38.9649 59.4136 62.0999 64.2116 74.0145 90.3124 123.9817 152.8297 159.1152 176.9342 177.3329 192.0659 193.7382 211.3309 221.6142 232.9150 254.5097 294.1659 295.2224 330.2304 343.7106 343.8338 359.9960 394.1121 410.6257 410.6950 418.4908 447.2796 484.2243 491.9041 500.2316 506.7703 508.7072 512.9409 554.6322 626.6760 626.7372 630.7423 631.4063 676.1632 677.6330 702.2193 706.0988 726.4832 726.8725 758.1204 810.0770 820.7706 823.9831 824.4623 828.5806 829.4225 841.0819 864.3472 877.8469 878.3560 919.5662 942.5332 953.6231 953.6495 966.1187 966.1413 973.3181 998.0818 998.2269 1002.0045 1008.1409 1009.0502 1069.4843 1073.6312 1077.1662 1093.2272 1101.2863 1102.8202 1109.7949 1109.8924 1179.8050 1186.5231 1187.7556 1189.3330 1198.0664 1215.8778 1216.1654 1235.7780 1280.1194 1286.5852 1290.6040 1290.8793 1305.9159 1307.4312 1316.5978 1325.4534 1325.8026 1345.5421 1356.1780 1371.2491 1375.8627 1376.6776 1403.8461 1403.8504 1443.9118 1444.6382 1457.7425 1469.6653 1477.4974 1478.2711 1483.2714 1485.9896 1574.0096 1574.0156 1580.2472 1581.7219 1598.9183 1598.9566 1655.6893 1656.0544 2973.0347 2975.4142 3000.0634 3001.0516 3031.5770 3053.4879 3073.0517 3073.2398 3097.6309 3097.6396 3106.2120 3106.3298 3137.6711 3137.6946 3143.8897 3143.9120 3171.8247 3171.8459 3175.1815 3175.1948 3557.4522 3557.4922
redmass: 11.0237 5.7955 4.1144 9.8789 5.2330 6.5871 4.6345 6.1347 7.1309 8.6538 5.8722 4.0136 2.7515 3.4867 3.9379 4.4359 4.3073 4.5966 3.2949 5.9647 5.9900 4.5268 5.4883 3.0502 4.1204 3.1687 4.0750 4.1381 3.6656 5.6881 2.8495 2.8743 5.6397 3.2740 1.7629 2.1667 4.0168 2.0893 1.5701 2.2590 2.2747 6.8881 6.9859 5.9379 6.3638 3.7651 4.0498 4.0797 4.1481 3.5286 3.6947 1.5660 3.1937 2.8780 1.2782 1.2799 1.5903 1.5899 3.2541 2.4984 1.9314 1.9429 3.2025 2.7021 1.3462 1.3458 1.3733 1.3729 2.3789 4.0537 4.0383 2.4104 1.2115 1.2089 3.6944 2.8665 3.0747 3.0588 2.3572 2.4318 1.3891 1.4063 1.2724 1.3167 1.1322 1.3701 1.8404 1.6700 1.7394 1.3851 1.1719 1.3130 1.6485 1.5401 1.6221 1.5892 1.2362 1.4639 1.4104 1.4195 1.2942 1.5634 4.3496 3.1472 3.3504 3.3468 1.1664 1.1574 1.0806 1.0978 2.0138 2.1598 2.0719 2.0357 7.1085 7.1065 6.6200 6.5657 6.0924 6.0947 5.6461 5.6854 1.0613 1.0630 1.0632 1.0622 1.0933 1.1004 1.1028 1.1034 1.0924 1.0924 1.0880 1.0880 1.0900 1.0900 1.0886 1.0886 1.0956 1.0956 1.0965 1.0965 1.0781 1.0781
irintensity: 0.0265 0.5216 6.9837 0.1053 0.0416 0.1351 7.7938 4.0618 3.2588 11.0941 0.4026 0.5061 0.2777 0.8262 0.6526 0.1767 2.3731 0.6297 1.3226 1.6795 0.4484 4.6324 5.5843 1.0025 0.0056 0.9785 5.5367 0.4948 41.3880 10.9069 0.0108 0.0781 14.9760 10.9896 21.7548 219.5616 1.9833 14.7403 2.1862 74.9962 5.1900 0.9054 0.0833 0.7885 3.1779 0.0018 0.8222 10.3504 3.8625 3.0030 0.7139 38.4591 14.7952 8.9643 0.4962 5.1891 167.0113 13.5990 3.6036 3.8919 12.9504 0.7847 10.2140 2.2789 4.4743 0.2019 0.0887 0.6319 5.0783 14.1613 54.6258 15.4889 88.3384 5.7795 1.9846 114.4738 30.1636 0.7488 5.4884 0.2138 17.7933 2.7892 3.3355 18.5206 0.0940 30.7748 166.5263 5.4757 53.3748 8.6927 2.6980 30.5341 3.3982 24.9354 10.3357 73.4644 8.5228 48.5574 18.2962 0.1459 3.2145 6.7203 7.3851 30.6081 15.6982 7.9082 81.1803 5.1960 0.5113 20.8974 34.9018 0.1005 69.3861 644.5259 0.2057 1.3335 82.8554 258.5255 28.0221 2.4115 26.4532 123.8396 24.4897 48.6514 13.9556 88.9593 4.6244 104.5133 19.2383 11.6310 1.5960 0.2607 2.6595 25.9751 1.1839 13.0790 5.9248 6.0808 1.1137 12.2441 0.5354 2.3448 22.2178 23.2286
temp: 298.150 k
press: 1.00000 atm
elementType: 17 17 8 8 7 7 6 6 6 6 6 6 6 6 6 6 6 6 6 6 6 6 6 6 6 6 6 6 1 1 1 1 1 1 1 1 1 1 1 1 1 1 1 1 1 1 1 1 1 1
symmnumber: 1
zpe: 1022742.8 jmol-1
zpe.correction: 0.389542 hartree
zpe.thermalcorrener: 0.417433 hartree
zpe.thermalcorrenthalpy: 0.418377 hartree
zpe.thermalcorrgfe: 0.321339 hartree
zpe.sumelectzpe: -2029.605709 hartree
zpe.sumelectthermal: -2029.577819 hartree
zpe.sumelectthermalent: -2029.576874 hartree
zpe.sumelectthermalfe: -2029.673912 hartree
dipole: 0.0049 3.5396 -0.0001
dipole: 3.5396
quadrupole: -188.5949 -169.2020 -177.4910
quadrupole: 0.0262 -14.9853 0.0199
quadrupole: -10.1656 9.2273 0.9383 0.0262 -14.9853 0.0199
hfenergy: -2029.9952513 hartree
pointgroup: C01 [X(C22H22Cl2N2O2)]
dipole: 0.000804 -1.3925934 0.0001824 debye
polarizability: 195.0215298|-0.141524|504.6793343|25.4887268|-0.0305425|243.5664354 unknown
InChI: InChI=1S/C22H22Cl2N2O2/c23-19-9-3-17(4-10-19)7-13-21(27)25-15-1-2-16-26-22(28)14-8-18-5-11-20(24)12-6-18/h3-14,25-26H,1-2,15-16H2
charge 0 multiplicity 1
50 atoms
Cl 5.17396 5.389586 0.745396
Cl -5.178741 5.383923 -0.747216
O  2.164586 -2.522378 -2.286232
O  -2.162035 -2.524265 2.286992
N  2.367092 -3.581193 -0.222715
N  -2.363378 -3.583884 0.223772
C  0.302839 -4.943505 -0.709743
C  -0.297588 -4.943721 0.711153
C  1.849964 -4.863817 -0.728339
C  -1.844806 -4.865789 0.729738
C  2.476417 -2.468702 -1.050719
C  -2.473901 -2.471275 1.051459
C  2.989854 -1.237834 -0.382551
C  -2.988553 -1.241124 0.382905
C  3.162593 -0.087491 -1.098547
C  -3.162435 -0.090728 1.098538
C  3.650382 1.210175 -0.612334
C  -3.651425 1.206325 0.611897
C  4.005881 1.456372 0.746515
C  -4.00712 1.451759 -0.747039
C  3.7747 2.283503 -1.540668
C  -3.77674 2.27984 1.539879
C  4.467582 2.71915 1.162789
C  -4.469951 2.713984 -1.163735
C  4.235759 3.555092 -1.141908
C  -4.238936 3.550883 1.140695
C  4.576888 3.754002 0.209476
C  -4.580211 3.749047 -0.210761
H  -0.003228 -5.864324 -1.247987
H  -0.082184 -4.084847 -1.291779
H  0.009529 -5.864095 1.249559
H  0.086457 -4.084521 1.29304
H  2.205779 -4.971448 -1.768135
H  2.28599 -5.680089 -0.121688
H  -2.279911 -5.682717 0.123309
H  -2.200492 -4.973539 1.769565
H  2.59124 -3.489676 0.768854
H  -2.587589 -3.492875 -0.767829
H  3.218871 -1.290918 0.690632
H  -3.217474 -1.294761 -0.690272
H  2.902308 -0.152277 -2.165594
H  -2.902128 -0.154932 2.165615
H  3.919489 0.657863 1.49091
H  -3.919985 0.653086 -1.491174
H  3.505493 2.11742 -2.590208
H  -3.507403 2.114344 2.589479
H  4.737453 2.901587 2.206909
H  -4.739962 2.895837 -2.207922
H  4.326848 4.371553 -1.86358
H  -4.330775 4.367496 1.862099
