program: Gaussian 09
title: 000267621
version: EM64L-G09RevD.01
frameworkgroup: C1[X(C13H8N2O7)]
method: RPBEPBE
basis: SDD
operation: Freq
keyword: #p
keyword: freq=noraman
keyword: PBEPBE/SDD
title: #p freq=noraman PBEPBE/SDD
converged: YES YES NO NO
title: Mulliken charges:
elementType: O O O O O O O N N C C C C C C C C C C C C C H H H H H H H H
charge: -0.251284 -0.251267 -0.183002 -0.199950 -0.199966 -0.189527 -0.189644 0.026354 0.026432 0.306291 0.306308 0.271529 0.271692 -0.308586 -0.308695 -0.342737 -0.342860 -0.200690 -0.200691 -0.208394 -0.208393 0.253182 0.277486 0.277469 0.289887 0.289920 0.247643 0.247645 0.246924 0.246924
chargesum: 0.00000
title: Mulliken charges with hydrogens summed into heavy atoms:
elementType: O O O O O O O N N C C C C C C C C C C C C C
charge: -0.251284 -0.251267 -0.183002 -0.199950 -0.199966 -0.189527 -0.189644 0.026354 0.026432 0.306291 0.306308 0.271529 0.271692 -0.031100 -0.031226 -0.052849 -0.052941 0.046953 0.046954 0.038529 0.038532 0.253182
polarizability: 2.52306053e+02 -2.01572791e+01 2.14091365e+02 -4.12492112e-02 -2.20099324e-02 8.83176801e+01
1716.lowfreq: -1.4127 -0.0005 0.0004 0.0006 3.8463 4.2907 9.5617 12.3510 27.7799
frequency: 5.6823 12.2042 27.7702 42.4957 64.3530 87.7635 96.4226 125.6906 132.0833 168.4883 204.5452 242.7465 257.5438 260.0161 273.2907 344.2626 362.9596 383.6103 409.9465 426.9854 429.4343 491.9653 510.1108 519.9916 538.6737 545.2370 622.5645 622.7141 641.2143 646.0093 651.1875 663.9296 672.7256 717.6455 739.5408 755.7669 771.1360 784.7785 787.0713 818.4900 821.0848 888.1728 889.4326 934.4229 975.0616 975.3914 1000.7069 1000.7707 1031.8349 1032.5094 1060.2702 1069.2609 1101.7116 1135.6507 1135.6707 1170.4001 1171.7360 1188.9242 1201.9584 1214.9523 1223.8384 1262.6050 1263.9028 1365.4463 1365.9977 1392.4785 1393.3918 1438.9043 1439.3899 1464.7530 1467.2012 1586.8062 1587.6969 1604.3117 1605.0535 1690.1087 3151.8426 3151.8524 3167.0632 3167.1212 3180.1287 3180.1482 3188.7623 3188.7742
redmass: 8.4079 9.1679 12.6702 6.4857 11.0284 9.6643 5.2279 9.0022 5.6912 9.4766 7.4209 10.1661 5.9058 10.0135 6.6537 9.6145 11.3977 10.8219 8.0620 3.7467 3.9916 5.1296 4.0171 6.5847 6.8802 7.5999 6.8288 9.9308 6.5754 6.4714 7.2861 5.3679 5.1526 4.4641 5.0399 8.9301 4.0097 1.9020 1.3938 7.1531 4.7086 1.4228 1.5046 8.6209 1.3687 1.3789 1.3418 1.3416 2.5002 2.4808 3.7912 3.1479 9.5549 1.7701 1.8508 1.2358 1.1481 2.2825 5.2008 8.9078 3.9242 1.5234 1.6085 8.0098 7.5756 8.7185 8.8945 2.4283 2.4455 2.6552 2.7532 7.3216 7.3259 6.8078 6.7689 12.8828 1.0872 1.0872 1.0915 1.0914 1.0955 1.0955 1.0992 1.0992
irintensity: 2.8312 2.8970 2.8953 4.0680 0.0035 0.0139 1.3047 0.0744 0.4885 0.0275 0.5595 6.1861 0.0018 0.5793 5.2521 0.0025 0.0467 4.7660 0.0001 0.9545 1.4409 0.4454 15.6077 1.8307 0.9294 0.2085 0.7782 10.2465 20.8226 3.8585 1.3502 22.6621 17.2404 17.5355 0.4144 25.1407 11.8405 77.0102 32.1597 12.5255 45.9221 1.0521 1.1940 5.9768 1.1321 9.1564 0.5420 0.0473 3.0603 0.1142 211.6442 0.2818 1442.6318 14.1139 62.7239 40.8346 0.0043 24.8964 0.1360 566.8747 0.5827 20.7944 0.0018 253.4897 7.3193 0.1601 5.6236 1.2062 26.6827 208.3513 5.7155 0.3533 46.6486 2.4831 81.6102 218.0003 6.3140 0.6808 17.9052 0.9668 0.2064 0.0019 10.3596 5.6421
temp: 298.150 k
press: 1.00000 atm
elementType: 8 8 8 8 8 8 8 7 7 6 6 6 6 6 6 6 6 6 6 6 6 6 1 1 1 1 1 1 1 1
symmnumber: 1
zpe: 516706.3 jmol-1
zpe.correction: 0.196803 hartree
zpe.thermalcorrener: 0.215257 hartree
zpe.thermalcorrenthalpy: 0.216201 hartree
zpe.thermalcorrgfe: 0.145222 hartree
zpe.sumelectzpe: -1134.509977 hartree
zpe.sumelectthermal: -1134.491523 hartree
zpe.sumelectthermalent: -1134.490578 hartree
zpe.sumelectthermalfe: -1134.561557 hartree
dipole: 0.0056 0.0032 -0.3914
dipole: 0.3914
quadrupole: -85.8031 -128.4961 -129.1118
quadrupole: -31.9840 0.0091 0.0028
quadrupole: 28.6672 -14.0257 -14.6415 -31.9840 0.0091 0.0028
hfenergy: -1134.7067798 hartree
pointgroup: C01 [X(C13H8N2O7)]
dipole: 0.0021495 -0.000984 0.1539846 debye
polarizability: 250.6255725|21.6267032|215.7715139|0.1150638|-0.1667399|88.3180114 unknown
InChI: InChI=1S/C13H8N2O7/c16-13(21-11-7-3-1-5-9(11)14(17)18)22-12-8-4-2-6-10(12)15(19)20/h1-8H
charge 0 multiplicity 1
30 atoms
O  -1.024638 -0.419767 -0.853789
O  1.022358 0.420939 -0.853149
O  -0.001913 0.000847 1.231081
O  -3.803387 2.59685 0.406253
O  3.795429 -2.59703 0.419312
O  -1.643271 2.121754 -0.122346
O  1.638147 -2.120811 -0.119531
N  -2.85207 1.761105 0.155702
N  2.846178 -1.760782 0.162713
C  -2.285543 -0.69188 -0.267381
C  2.283151 0.692153 -0.266202
C  -3.18079 0.315752 0.186223
C  3.176497 -0.315729 0.190718
C  -2.684468 -2.041688 -0.245737
C  2.684008 2.041446 -0.247147
C  -4.46057 -0.044899 0.670583
C  4.456143 0.044327 0.675923
C  -3.959771 -2.396987 0.239858
C  3.959234 2.396086 0.239085
C  -4.847897 -1.396509 0.702651
C  4.845365 1.395438 0.705327
C  -0.001469 0.000656 -0.003041
H  -1.97666 -2.792524 -0.60841
H  1.977633 2.792439 -0.612278
H  -5.127059 0.753119 1.008001
H  5.121061 -0.753844 1.016063
H  -4.255524 -3.450579 0.260296
H  4.256445 3.449307 0.257413
H  -5.836604 -1.66898 1.083624
H  5.833986 1.66739 1.086889
