program: Gaussian 09
title: 000267628
version: EM64L-G09RevD.01
frameworkgroup: C1[X(C19H20FNO4S)]
method: RPBEPBE
basis: SDD
operation: Freq
keyword: #p
keyword: freq=noraman
keyword: PBEPBE/SDD
title: #p freq=noraman PBEPBE/SDD
converged: YES YES NO NO
title: Mulliken charges:
elementType: S F O O O O N C C C C C C C C C C C C C C C C C C C H H H H H H H H H H H H H H H H H H H H
charge: 0.869998 -0.195581 -0.326806 -0.265760 -0.537579 -0.532713 -0.469413 0.055659 -0.430712 -0.445008 -0.400333 -0.397133 -0.388849 0.254165 0.503478 -0.094977 -0.437734 -0.335791 -0.218214 -0.228930 -0.081402 -0.198772 -0.199541 -0.344500 -0.345024 0.336261 0.233886 0.201575 0.235997 0.214528 0.205730 0.209060 0.201715 0.199135 0.208624 0.206016 0.192423 0.334911 0.236964 0.311490 0.281296 0.275347 0.284430 0.285228 0.268099 0.268761
chargesum: 0.00000
title: Mulliken charges with hydrogens summed into heavy atoms:
elementType: S F O O O O N C C C C C C C C C C C C C C C C C C C
charge: 0.869998 -0.195581 -0.326806 -0.265760 -0.537579 -0.532713 -0.134502 0.289545 0.006860 -0.024750 0.010442 0.010626 0.009589 0.254165 0.503478 -0.094977 -0.200771 -0.024301 0.063082 0.046417 -0.081402 0.085658 0.085687 -0.076402 -0.076263 0.336261
polarizability: 3.64583593e+02 -7.14810173e+00 1.96742430e+02 4.46244333e+00 6.21010136e+00 2.23805139e+02
1716.lowfreq: -5.9396 -0.0010 0.0011 0.0011 1.3672 8.8428 13.5513 29.0417 29.8688
frequency: 13.3913 28.7297 29.7274 36.1198 44.0315 50.0452 71.0026 81.9187 98.9462 117.1954 129.8207 144.0481 163.6029 178.1426 214.0948 221.9207 222.6280 255.6539 274.5784 305.7946 322.1951 324.0633 330.5140 343.5073 377.9782 412.2955 414.3349 415.4533 415.7032 428.3008 435.0716 449.9861 472.3085 517.3037 529.2933 541.4288 582.6112 614.2308 616.0245 647.2089 649.8878 705.3776 711.8383 713.8784 728.3301 774.3664 786.1535 789.6754 792.8142 823.0282 827.0289 836.5475 845.4115 846.7776 866.5973 887.3770 897.1984 908.2135 924.3822 924.7537 953.0445 961.3971 966.5782 986.8142 991.0165 991.7478 995.2386 1004.5001 1044.2580 1045.4930 1053.9391 1055.8488 1082.8934 1100.3752 1111.5840 1122.8920 1152.0136 1152.7456 1161.7134 1184.9512 1193.6862 1199.0731 1242.2349 1253.0238 1258.0242 1265.7059 1276.8813 1297.4391 1303.6948 1310.1536 1331.9696 1337.3013 1340.7839 1351.6026 1361.1817 1379.8686 1391.6146 1393.3839 1407.9656 1463.8770 1465.0811 1466.3084 1466.7351 1473.1913 1475.7404 1481.0879 1512.2940 1587.6951 1598.1539 1601.6437 1610.1882 1655.4925 2970.8780 2973.2315 2975.8785 2985.9865 2988.7465 3011.8801 3035.9461 3038.4527 3046.7051 3055.8300 3064.6089 3129.4704 3153.9615 3156.8937 3158.8319 3161.6806 3181.7472 3183.9434 3192.4250 3540.1631
redmass: 6.8446 4.9664 5.0664 4.1157 3.9491 4.3470 6.4532 6.8593 5.9614 7.8877 5.9406 7.1808 6.0942 7.1285 2.3341 4.2347 5.4924 7.5679 7.2658 6.3340 2.1943 5.7861 6.4428 6.6933 5.6794 5.3483 3.5147 3.0348 5.9550 3.1784 4.1006 2.6388 3.4151 2.8123 2.8451 2.7860 7.7613 7.1519 7.1333 2.4132 2.0774 4.7788 5.6984 4.5960 3.4695 9.0036 2.6092 1.5127 6.0863 1.2432 4.0396 1.3868 1.6098 2.0292 1.4747 1.8077 1.6180 4.3169 2.8029 3.4195 1.3447 1.3663 1.3594 5.5459 1.3491 4.2282 4.5857 3.7527 2.3959 1.8611 1.1006 2.3788 1.2999 1.2737 2.6716 1.3058 1.3120 2.3123 3.2524 1.1323 2.9026 1.4974 1.3241 1.2780 1.3100 2.0000 1.2465 1.3825 1.2294 1.3119 1.3533 1.5023 1.4526 1.5432 1.4878 4.2666 5.2374 4.8085 4.6036 1.0849 2.4021 1.0902 1.0875 1.0838 2.2124 1.0997 2.4179 6.2451 6.2658 5.7509 8.2588 7.8372 1.0654 1.0624 1.0631 1.0614 1.0637 1.0833 1.0956 1.0981 1.1008 1.1024 1.1028 1.0896 1.0908 1.0901 1.0899 1.0952 1.0961 1.0971 1.0950 1.0762
irintensity: 0.1557 0.5443 0.3478 0.0286 0.3931 0.9326 0.9924 4.1396 3.2306 3.1412 2.6442 2.2674 0.1401 0.2609 3.5446 1.8393 11.1062 3.9301 8.2622 5.1503 0.7989 2.4673 9.4209 21.8213 1.4869 7.3820 1.8571 0.2232 3.7275 1.6959 10.6205 42.6958 58.5047 73.4070 65.9473 33.2032 37.3092 0.1437 0.3193 38.2320 16.8307 41.5659 6.7984 11.5755 3.9341 50.3143 7.4132 7.2919 91.6802 0.4314 25.8312 25.9523 45.6792 9.5394 47.1605 6.3861 13.6492 4.2656 30.9265 44.3473 0.9384 0.7138 0.1947 51.3115 2.6461 81.3924 9.9099 398.3867 30.3428 5.3862 2.3184 18.2875 7.7663 7.0675 1.5400 25.9161 132.6141 1.5823 657.1740 11.0134 63.6611 2.8854 0.7440 3.1695 5.9002 5.9796 5.7238 31.2205 0.8989 1.5523 0.5064 11.6019 2.6452 0.6027 68.2029 179.8165 6.3180 8.2476 24.3423 0.7847 101.1025 12.5814 8.9244 21.0844 1.3236 5.9100 767.9192 39.5788 79.0203 144.9839 9.3816 164.8277 34.8908 33.6542 31.7754 8.8961 20.4585 20.8371 65.8888 60.8850 35.9286 19.1544 72.2749 12.5095 1.5278 1.4733 1.1781 7.0451 0.0781 6.9514 6.2660 36.2271
temp: 298.150 k
press: 1.00000 atm
elementType: 16 9 8 8 8 8 7 6 6 6 6 6 6 6 6 6 6 6 6 6 6 6 6 6 6 6 1 1 1 1 1 1 1 1 1 1 1 1 1 1 1 1 1 1 1 1
symmnumber: 1
zpe: 933028.7 jmol-1
zpe.correction: 0.355372 hartree
zpe.thermalcorrener: 0.379691 hartree
zpe.thermalcorrenthalpy: 0.380635 hartree
zpe.thermalcorrgfe: 0.298183 hartree
zpe.sumelectzpe: -1587.533453 hartree
zpe.sumelectthermal: -1587.509134 hartree
zpe.sumelectthermalent: -1587.508190 hartree
zpe.sumelectthermalfe: -1587.590643 hartree
dipole: 6.4014 3.9814 -2.9693
dipole: 8.1022
quadrupole: -151.5222 -179.3795 -150.7467
quadrupole: -15.3650 -0.4911 4.6976
quadrupole: 9.0273 -18.8300 9.8028 -15.3650 -0.4911 4.6976
hfenergy: -1587.8888253 hartree
pointgroup: C01 [X(C19H20F1N1O4S1)]
dipole: -2.5419062 1.6302394 1.0208627 debye
polarizability: 364.3566536|9.2475086|196.0863292|4.7871665|-3.834342|224.6881793 unknown
InChI: InChI=1S/C19H20FNO4S/c20-14-6-10-17(11-7-14)26(23,24)18-12-8-15(9-13-18)21-19(22)25-16-4-2-1-3-5-16/h6-13,16,21H,1-5H2
charge 0 multiplicity 1
46 atoms
S  3.790252 -1.756498 -0.037434
F  6.849053 3.448168 -0.257299
O  -4.254386 0.108372 0.740389
O  -2.985971 -0.058278 -1.242611
O  4.30098 -2.51386 1.323653
O  3.907085 -2.402687 -1.537824
N  -2.073621 -0.427767 0.917114
C  -5.488639 0.424363 -0.058584
C  -6.153869 -0.879836 -0.531809
C  -6.399583 1.244564 0.862991
C  -7.487184 -0.561612 -1.255551
C  -7.734845 1.562238 0.141995
C  -8.430624 0.271613 -0.355352
C  -3.085552 -0.124931 0.007629
C  -0.719984 -0.727472 0.639863
C  1.976064 -1.315676 0.236381
C  0.131785 -0.985602 1.7518
C  -0.202519 -0.792254 -0.684983
C  1.491716 -1.286318 1.554365
C  1.159078 -1.096409 -0.883677
C  4.7185 -0.103577 -0.101565
C  5.244352 0.405626 1.097144
C  4.901405 0.50381 -1.354828
C  5.968436 1.617226 1.046171
C  5.624738 1.715742 -1.408902
C  6.130632 2.241446 -0.205106
H  -5.167991 1.020349 -0.935435
H  -6.350361 -1.519649 0.351419
H  -5.469023 -1.428302 -1.203522
H  -5.886424 2.174974 1.168533
H  -6.601417 0.658868 1.781433
H  -7.976429 -1.505265 -1.561518
H  -7.273232 0.003105 -2.18619
H  -7.537375 2.227876 -0.72349
H  -8.400434 2.120638 0.826834
H  -9.355267 0.527757 -0.907069
H  -8.736401 -0.33965 0.518743
H  -2.368113 -0.422418 1.896385
H  -0.273804 -0.9573 2.770175
H  -0.866503 -0.610938 -1.532037
H  2.15528 -1.520283 2.393101
H  1.571273 -1.188002 -1.894049
H  5.114738 -0.145815 2.033919
H  4.515266 0.026448 -2.261112
H  6.404164 2.065317 1.943211
H  5.80236 2.237701 -2.352999
