program: Gaussian 09
title: 000267592
version: EM64L-G09RevD.01
frameworkgroup: C1[X(C9H5NO3)]
method: RPBEPBE
basis: SDD
operation: Freq
keyword: #pfreq=noraman
keyword: PBEPBE/SDD
title: #p freq=noraman PBEPBE/SDD
converged: NO NO NO NO
title: Mulliken charges:
elementType: O O O N C C C C C C C C C H H H H H
charge: -0.195474 -0.190916 -0.230771 -0.386743 0.133200 0.271314 0.059624 -0.223277 0.016802 0.071984 -0.270110 -0.245898 -0.263215 0.367103 0.285491 0.258508 0.271528 0.270850
chargesum: 0.00000
title: Mulliken charges with hydrogens summed into heavy atoms:
elementType: O O O N C C C C C C C C C
charge: -0.195474 -0.190916 -0.230771 -0.019639 0.133200 0.271314 0.059624 0.062214 0.016802 0.071984 -0.011602 0.025630 0.007634
polarizability: 1.61153122e+02 1.15674153e+01 1.44881001e+02 1.45291454e-03 -5.89689903e-04 4.26398802e+01
1716.lowfreq: 0.0008 0.0009 0.0011 7.5415 16.2938 18.2744 90.9595 104.7876 149.1154
frequency: 90.9589 104.7856 149.1148 205.8380 237.1009 286.7691 329.9274 398.0627 401.4295 444.7808 461.2282 516.3092 544.2982 580.4568 615.1127 680.1822 690.8711 704.3276 748.6012 799.8543 843.3308 847.2783 861.2466 863.0594 995.3049 1004.4259 1035.4920 1042.5080 1099.6683 1155.8158 1225.9562 1248.8286 1286.9746 1316.0646 1352.3097 1407.9044 1453.9174 1525.2721 1542.1788 1565.6055 1588.2389 1625.1521 1661.1713 3149.3907 3156.9284 3173.5959 3187.6051 3438.7009
redmass: 7.2462 8.1839 6.1875 10.5874 6.1632 4.4603 12.6112 9.3188 3.6596 11.5558 6.5622 8.0429 3.7821 4.6335 2.7222 6.7166 6.8847 3.4181 7.2425 4.4065 1.7620 1.3254 1.8620 4.6698 1.2971 1.3089 2.7469 3.4470 1.9668 1.4208 2.0697 2.6662 1.8039 2.6724 1.9379 2.9821 3.7269 10.6066 8.6500 9.0230 6.8908 6.7930 7.3717 1.0873 1.0899 1.1005 1.0968 1.0765
irintensity: 0.2714 15.4266 1.1097 1.0479 3.0399 0.3506 8.4459 16.1084 2.3007 0.4723 6.7287 9.3012 9.6611 1.9055 2.1971 0.6127 0.3169 8.0893 13.4392 0.0289 164.1213 21.4061 1.2621 4.5019 0.0008 0.6947 37.0760 23.1144 21.9439 48.6138 20.2514 35.1336 13.8320 144.4016 0.0072 74.6192 96.0333 78.7305 56.2785 248.3692 5.5506 117.8607 393.1459 0.4631 2.0930 5.5395 1.6363 80.9454
temp: 298.150 k
press: 1.00000 atm
elementType: 8 8 8 7 6 6 6 6 6 6 6 6 6 1 1 1 1 1
symmnumber: 1
zpe: 320862.0 jmol-1
zpe.correction: 0.122210 hartree
zpe.thermalcorrener: 0.131968 hartree
zpe.thermalcorrenthalpy: 0.132912 hartree
zpe.thermalcorrgfe: 0.086780 hartree
zpe.sumelectzpe: -625.490082 hartree
zpe.sumelectthermal: -625.480324 hartree
zpe.sumelectthermalent: -625.479380 hartree
zpe.sumelectthermalfe: -625.525511 hartree
dipole: -3.2909 -0.1401 -0.0013
dipole: 3.2939
quadrupole: -82.9468 -81.0814 -73.7439
quadrupole: -10.8042 -0.0015 -0.0051
quadrupole: -3.6894 -1.8241 5.5135 -10.8042 -0.0015 -0.0051
hfenergy: -625.6122915 hartree
pointgroup: C01 [X(C9H5N1O3)]
dipole: -1.2910723 -0.1120812 -0.0005109 debye
dipolederiv: -0.517028 -0.1493146 0.0000646 0.0606456 -0.9758317 0.0002687 0.0000187 -0.0003184 -0.314172 -0.6625573 -0.1152597 0.0000029 -0.4592276 -0.8383245 -0.0000026 0.000016 0.0000102 -0.3170795 -1.3402227 -0.2123706 -0.0000167 -0.4277372 -0.4246884 -0.0000081 -0.0000789 -0.0000099 -0.3633265 -0.9916638 -0.4813573 0.0000202 0.4197121 -0.2549591 -0.0000142 0.0000224 -0.0000333 -0.234221 0.1545562 0.8532533 -0.0000741 0.5102313 -0.0565514 -0.0000431 -0.0002894 0.0000379 0.125014 -0.8819801 -0.3574565 0.0000166 -0.123524 -0.2861275 -0.0000551 -0.0000282 0.0002678 -0.0406339 1.0052527 -0.0928025 -0.0000499 -0.1809288 1.2176009 -0.0000932 0.0000769 0.0001567 0.2101153 0.4012551 0.1434898 -0.0000173 -0.1996389 0.2128805 -0.0000358 -0.0000109 -0.0000749 -0.0588174 1.4003117 0.1468847 0.0000137 0.3756355 0.8747275 0.0000689 -0.0000743 -0.0000375 0.1878365 1.8270059 0.2980544 0.0000577 0.3436846 0.3497274 -0.0000062 0.0001534 0.0000407 0.211023 -0.3167195 -0.1750075 0.0000209 -0.5163417 -0.1584774 -0.0000198 0.0000604 -0.0000217 -0.1546345 -0.4204079 -0.2339478 0.0000264 -0.3061652 0.0130578 -0.0000032 0.0001212 -0.0000846 -0.1252412 0.0064883 0.2740375 -0.0001203 0.4114335 -0.1218462 -0.0000937 0.000024 0.0000968 -0.0721571 0.2265305 0.0664216 -0.0000159 -0.0010722 0.2666326 0.0000097 -0.0000904 -0.0000461 0.3103445 0.1148508 -0.0709744 0.0000116 0.0195681 0.0144195 0.0000196 0.0000538 -0.0000178 0.1499466 0.0195548 0.0627889 -0.0000126 0.0332396 0.0521964 0.0000179 -0.0000312 0.0000356 0.1702024 0.0124469 0.0443516 0.000016 0.082025 0.0326908 -0.0000062 0.0000138 -0.00001 0.1625716 -0.0376739 -0.0007908 0.0000559 -0.0415398 0.0828728 -0.0000036 0.0000426 0.0000084 0.1532293 unknown
polarizability: 160.1039683|12.2383142|145.9301549|0.0014775|-0.0005251|42.6398802 unknown
InChI: InChI=1S/C9H5NO3/c11-6-2-3-7(12)9-5(6)1-4-8(13)10-9/h1-4,10H
charge 0 multiplicity 1
18 atoms
O  -0.641281 2.845869 0.000436
O  -2.013956 -2.460668 -0.000043
O  3.688439 0.555426 0.000055
N  1.37952 0.956316 -0.000191
C  0.072651 0.547047 -0.000222
C  -0.247279 -0.81557 -0.000074
C  -0.976238 1.619216 -0.000653
C  0.834684 -1.768939 0.000093
C  -1.665529 -1.234665 -0.00003
C  2.518618 0.077399 0.0000
C  2.151393 -1.344904 0.000139
C  -2.387459 1.170533 -0.000085
C  -2.707391 -0.159705 0.000001
H  1.565391 1.970791 -0.00042
H  0.579845 -2.833761 0.0002
H  2.984968 -2.052219 0.000282
H  -3.147077 1.959396 0.000154
H  -3.746401 -0.507761 0.000258
