program: Gaussian 09
title: 000267642
version: EM64L-G09RevD.01
frameworkgroup: C1[X(C19H21NO5S)]
method: RPBEPBE
basis: SDD
operation: Freq
keyword: #p
keyword: freq=noraman
keyword: PBEPBE/SDD
title: #p freq=noraman PBEPBE/SDD
converged: YES YES NO NO
title: Mulliken charges:
elementType: S O O O O O N C C C C C C C C C C C C C C C C C C C H H H H H H H H H H H H H H H H H H H H H
charge: 0.897208 -0.555544 -0.560550 -0.356018 -0.275572 -0.217830 -0.459291 -0.089415 -0.505643 -0.249465 -0.231939 0.508262 -0.634815 -0.322279 -0.432768 0.544933 0.258024 -0.618253 0.202822 -0.496075 -0.474609 -0.303008 0.208987 -0.026622 -0.515794 -0.586693 0.257339 0.259977 0.286309 0.291688 0.229211 0.256638 0.256669 0.308345 0.238693 0.229145 0.217012 0.272196 0.341883 0.237320 0.242437 0.231695 0.236315 0.234400 0.227659 0.217102 0.219918
chargesum: 0.00000
title: Mulliken charges with hydrogens summed into heavy atoms:
elementType: S O O O O O N C C C C C C C C C C C C C C C C C C C
charge: 0.897208 -0.555544 -0.560550 -0.356018 -0.275572 -0.217830 -0.117409 -0.089415 0.011672 0.036844 0.059749 0.508262 0.107703 -0.013934 -0.194075 0.544933 0.258024 -0.172096 0.202822 -0.223879 -0.237289 -0.060571 0.208987 0.205073 0.182579 -0.149673
polarizability: 4.34435794e+02 -8.58155148e+00 2.06116840e+02 -1.26345544e+01 6.21976053e+00 1.93584205e+02
1716.lowfreq: -4.2359 -0.0015 -0.0010 0.0006 0.2406 4.9835 14.2151 16.0755 17.9471
frequency: 14.1864 15.7319 17.8040 28.0585 40.0532 42.3053 44.1364 61.3439 67.8643 72.5968 86.8783 89.7250 121.6505 137.6787 150.5730 162.4665 182.4745 192.0771 201.6089 226.9911 228.3371 245.5568 258.3173 271.6721 304.2569 317.9697 321.6545 355.6323 357.4100 369.2605 379.6872 382.1265 413.5395 448.1394 465.3786 471.0296 502.5602 516.4538 553.3399 564.2204 607.0630 617.0486 619.3087 651.7242 658.9446 680.6356 701.2156 715.9563 722.7238 739.7940 764.5177 779.5680 789.3971 811.6227 838.3496 853.2117 865.0551 872.4320 898.5276 908.6909 920.9419 937.1894 941.6968 946.7453 951.2235 964.0109 974.1900 990.9612 991.3146 1005.0343 1015.2451 1040.8719 1057.1936 1066.3441 1088.8192 1105.8269 1116.1522 1121.3588 1137.7729 1148.4458 1161.0642 1180.7427 1186.2593 1211.5709 1236.7688 1248.2584 1248.7231 1257.1334 1264.7278 1287.6261 1299.3224 1304.5154 1377.0181 1381.5542 1393.8258 1401.6115 1406.5608 1409.8452 1425.4163 1442.0241 1455.0171 1461.9742 1462.1676 1475.9828 1476.9447 1482.4759 1484.6918 1512.8291 1584.5223 1599.2145 1602.5047 1614.9335 1656.7902 1685.7084 2967.9357 2978.6195 2992.8506 3018.2336 3043.8425 3082.0573 3083.8616 3087.6928 3097.1167 3102.5089 3117.1637 3129.0451 3134.8069 3138.5553 3152.2329 3154.6081 3158.0181 3159.8745 3191.4580 3196.6503 3534.8592
redmass: 4.7759 5.5952 4.3606 2.6720 4.2891 5.5990 4.1195 3.1629 3.7459 4.8964 4.2854 5.1601 5.0239 6.2495 2.8502 5.6625 2.6968 1.4929 1.9842 3.8680 3.7618 3.1872 2.3627 3.7877 5.8521 7.6312 6.4861 5.3201 3.6587 4.6315 4.3517 3.3827 2.9779 4.6441 3.4194 4.0075 3.5149 3.4039 4.5862 5.3074 3.6717 6.6613 2.9898 2.0061 3.4857 3.6907 3.2852 4.4850 3.4835 4.4201 4.0679 1.2081 12.3517 1.5865 1.3953 3.7777 1.5350 2.0283 2.3800 5.1127 1.5202 2.0504 2.1409 2.5218 1.4708 1.3600 1.5585 1.3446 4.6579 3.2010 1.2105 1.4058 2.4782 2.6634 3.1820 1.2635 1.7796 1.3806 2.6903 1.4330 1.8804 1.7421 1.1263 1.3145 1.2465 2.1943 1.2907 1.4102 2.0691 1.2938 1.3645 1.8370 5.4217 7.3781 1.1627 2.1660 4.2530 1.1337 1.1930 1.3596 1.1400 1.0648 1.0347 2.0852 1.0814 1.0508 2.7903 2.3777 7.8637 5.9658 5.8606 6.7865 4.7075 9.1911 1.0594 1.0312 1.0360 1.0997 1.0568 1.1036 1.0633 1.0976 1.0906 1.1019 1.1027 1.0896 1.0881 1.1098 1.0911 1.0918 1.0958 1.0967 1.0950 1.1143 1.0762
irintensity: 1.8572 1.8868 0.2170 0.1722 0.9301 2.3200 1.7789 7.5031 1.0706 1.5741 4.6080 2.3476 1.2089 0.9768 0.1331 2.9865 5.4193 0.0477 0.4391 8.7489 23.7404 0.9060 2.8859 8.7300 0.1449 17.9305 2.3323 2.9457 1.0272 13.7216 0.1994 0.4486 0.0005 2.1196 24.0031 23.9673 3.9054 29.4839 96.1201 6.3370 15.6549 0.6487 20.0493 25.5256 8.5261 7.5483 56.1232 19.2452 3.8099 10.0047 2.1798 1.7002 103.2987 36.1359 32.7352 9.2080 41.3292 8.9421 26.2033 78.7664 21.5082 16.2916 97.0765 206.0312 43.0167 6.8935 27.0948 1.1615 2.7945 90.2343 6.6287 7.1465 50.3420 24.4246 292.6353 22.4782 31.1917 64.8928 479.2626 9.7776 18.3590 48.9331 16.6187 12.0741 0.3748 123.8804 4.1484 12.3675 6.7515 10.3115 25.5257 36.0409 229.6705 25.0438 30.7597 48.1031 28.4327 1.8381 6.6202 6.9952 39.3474 13.5234 22.2809 3.3397 29.7971 13.6590 305.4953 567.6664 26.8652 55.6695 153.5063 59.4677 16.3689 192.1115 25.8207 63.5668 19.0740 13.0621 10.3233 33.9896 17.3187 8.8851 8.7259 3.4144 29.3655 11.0544 11.2465 6.8839 1.7459 4.0781 9.8575 5.9580 4.2675 27.6766 38.7680
temp: 298.150 k
press: 1.00000 atm
elementType: 16 8 8 8 8 8 7 6 6 6 6 6 6 6 6 6 6 6 6 6 6 6 6 6 6 6 1 1 1 1 1 1 1 1 1 1 1 1 1 1 1 1 1 1 1 1 1
symmnumber: 1
zpe: 948053.6 jmol-1
zpe.correction: 0.361095 hartree
zpe.thermalcorrener: 0.388516 hartree
zpe.thermalcorrenthalpy: 0.389461 hartree
zpe.thermalcorrgfe: 0.298104 hartree
zpe.sumelectzpe: -1563.457010 hartree
zpe.sumelectthermal: -1563.429588 hartree
zpe.sumelectthermalent: -1563.428644 hartree
zpe.sumelectthermalfe: -1563.520000 hartree
dipole: 3.1641 4.6671 0.2806
dipole: 5.6455
quadrupole: -184.9804 -159.4483 -157.9011
quadrupole: -37.7818 7.7938 -3.5765
quadrupole: -17.5371 7.9950 9.5422 -37.7818 7.7938 -3.5765
hfenergy: -1563.8181045 hartree
pointgroup: C01 [X(C19H21N1O5S1)]
dipole: -1.248181 -1.8288884 -0.1746935 debye
polarizability: 434.5350468|-10.7807949|207.7759037|9.6414371|-3.8926761|191.8258879 unknown
InChI: InChI=1S/C19H21NO5S/c1-4-6-14-7-12-17(18(13-14)24-3)25-19(21)20-15-8-10-16(11-9-15)26(22,23)5-2/h4,7-13,20H,1,5-6H2,2-3H3
charge 0 multiplicity 1
47 atoms
S  6.501552 0.433551 -0.131198
O  6.683551 1.788749 -1.034767
O  7.263614 0.23309 1.307499
O  -1.687494 -0.391954 0.953273
O  -3.61937 -2.260817 -0.31942
O  -0.571067 0.700839 -0.83377
N  0.560294 -0.319141 0.988256
C  4.653379 0.185243 0.175813
C  7.034006 -1.066234 -1.259767
C  3.735079 0.749289 -0.724145
C  4.262536 -0.500256 1.338218
C  1.928622 -0.120295 0.676461
C  8.531606 -0.949825 -1.523493
C  2.355528 0.592499 -0.478361
C  2.885647 -0.654821 1.584163
C  -5.642948 0.826147 -0.068418
C  -2.9860 0.029056 0.508963
C  -7.069698 1.261631 -0.409556
C  -3.890666 -0.914629 -0.044871
C  -5.2179 -0.497938 -0.311444
C  -4.710163 1.757942 0.457957
C  -3.391799 1.356806 0.745933
C  -0.543663 0.07735 0.247681
C  -8.131611 0.233928 -0.06527
C  -2.26621 -2.65807 -0.749867
C  -9.038474 -0.268795 -0.939857
H  6.744636 -1.952893 -0.673159
H  6.404429 -0.95431 -2.157019
H  4.089776 1.327165 -1.584333
H  5.016862 -0.871574 2.039865
H  8.858807 -1.79068 -2.162481
H  8.769879 -0.006504 -2.044231
H  9.103024 -0.988371 -0.580223
H  1.614582 1.018061 -1.157778
H  2.551755 -1.184212 2.484642
H  -7.135705 1.498171 -1.490517
H  -7.286258 2.206335 0.129288
H  -5.908442 -1.239612 -0.725998
H  0.337793 -0.803645 1.861367
H  -5.017522 2.791703 0.650349
H  -2.670936 2.062132 1.172579
H  -8.145435 -0.104474 0.982054
H  -2.402458 -3.641487 -1.22555
H  -1.856144 -1.940284 -1.484804
H  -1.584399 -2.74939 0.112695
H  -9.794562 -0.99774 -0.627725
H  -9.05113 0.036467 -1.99403
