program: Gaussian 09
title: 000267591
version: EM64L-G09RevD.01
frameworkgroup: C1[X(C16H19N3O2)]
method: RPBEPBE
basis: SDD
operation: Freq
keyword: #p
keyword: freq=noraman
keyword: PBEPBE/SDD
title: #p freq=noraman PBEPBE/SDD
converged: YES YES NO NO
title: Mulliken charges:
elementType: O O N N N C C C C C C C C C C C C C C C C H H H H H H H H H H H H H H H H H H H
charge: -0.266061 -0.267527 -0.358080 -0.345254 -0.407134 -0.162883 -0.168117 -0.037199 -0.572868 0.094446 0.115475 0.387519 -0.727987 -0.714176 0.112633 -0.443527 0.227234 -0.409224 -0.349656 -0.256241 -0.214770 0.255525 0.268923 0.251361 0.261953 0.222274 0.327256 0.343247 0.204940 0.232400 0.219115 0.218364 0.218321 0.231609 0.276614 0.308930 0.245784 0.229094 0.224008 0.223680
chargesum: 0.00000
title: Mulliken charges with hydrogens summed into heavy atoms:
elementType: O O N N N C C C C C C C C C C C C C C C C
charge: -0.266061 -0.267527 -0.030824 -0.002007 -0.098204 0.092642 0.100807 0.214161 -0.088641 0.094446 0.115475 0.387519 -0.071532 -0.045882 0.112633 -0.166913 0.227234 -0.163440 -0.120563 -0.032233 0.008910
polarizability: 2.66456501e+02 1.42334590e+01 1.97666835e+02 1.64319684e+01 4.01332357e+00 1.26716444e+02
1716.lowfreq: -11.1721 -3.9278 -0.0008 -0.0001 0.0005 5.1789 13.8069 24.2460 34.2587
frequency: 13.4813 24.0212 34.2206 51.6690 64.6012 81.2151 94.3524 158.6451 166.9733 187.2453 201.4161 219.0071 225.5101 236.5018 257.3998 293.8772 324.3100 377.6343 407.1842 420.5525 426.0670 442.4820 455.6228 481.2934 508.5898 517.5818 530.1164 562.2484 576.3601 590.0637 610.5688 617.6260 640.8287 703.1816 717.5458 733.8787 750.5732 752.1842 760.1039 769.8252 795.0492 806.5369 831.2485 854.5475 866.9159 898.3407 921.0267 932.2227 936.8869 958.0494 975.7465 977.4300 1007.3221 1012.3427 1031.4016 1063.1696 1094.7012 1097.9487 1117.3829 1132.8805 1149.9804 1167.9005 1182.0757 1189.0263 1236.1939 1251.7376 1253.9359 1262.8194 1270.9222 1289.5923 1298.0058 1320.2666 1321.4313 1342.4320 1351.4912 1365.9895 1380.6539 1390.4476 1398.1381 1408.0785 1417.0333 1421.6778 1442.3376 1458.2389 1464.9842 1467.0623 1474.5987 1482.7147 1484.2694 1490.0049 1560.9038 1587.7121 1623.2962 1625.0638 1631.9477 2967.1865 2975.8497 2978.7406 2988.6902 3002.6062 3011.3903 3057.4925 3065.5789 3072.6265 3074.3787 3078.6260 3124.8094 3131.6993 3145.8015 3163.8588 3219.1333 3484.3171 3505.0350 3612.0988
redmass: 4.7182 5.0362 4.7632 3.6773 3.3212 5.2415 6.4958 4.5484 3.5761 5.4104 1.1426 4.0631 1.0505 3.2625 3.5054 3.5064 5.3893 2.6300 3.3733 4.0210 3.5170 7.9539 3.1314 4.9372 3.0178 1.4388 3.7749 4.3256 2.7903 2.9417 2.9144 3.3620 2.9931 1.9619 1.7437 3.4828 4.2184 1.3330 4.3715 3.8110 2.2592 2.2277 3.1542 1.4613 5.1818 2.5829 1.2030 2.3871 1.3981 1.5234 1.3103 2.3607 2.6272 2.1879 2.6029 3.4675 1.8441 1.6829 2.3547 1.4724 1.7787 1.1475 1.7615 1.4325 1.9026 1.5051 1.4684 1.2699 1.5259 1.7875 1.7849 1.6260 1.5380 1.5457 1.7463 1.6382 1.2477 5.1641 1.2231 3.4675 1.6677 2.4202 2.8437 3.7555 1.0795 1.0912 1.0537 2.9603 1.0581 1.0565 6.1350 6.1692 6.0368 5.6332 6.8513 1.0370 1.0450 1.0735 1.0809 1.0621 1.0850 1.0991 1.1029 1.0992 1.0994 1.0982 1.0853 1.0892 1.0953 1.1001 1.0984 1.0754 1.0752 1.0810
irintensity: 0.1226 0.8630 0.7889 0.3037 0.3472 0.5145 2.3795 3.4990 3.2289 2.3746 0.1210 7.9238 0.1325 0.3794 0.5188 4.3919 2.0782 10.6811 5.6138 13.9104 17.1573 0.5216 4.0656 0.6293 2.3122 74.8967 16.5684 13.4511 13.3666 18.8827 14.7370 3.5189 4.1842 10.8429 167.4797 28.9061 11.7170 111.2580 3.8448 27.6057 5.7629 1.6431 24.2800 0.4613 1.9083 13.8951 3.7637 4.6000 2.2033 1.2700 0.1001 6.6142 6.1496 13.9031 26.5212 10.4864 27.3357 54.1266 1.3000 0.5954 11.3551 0.7299 17.5492 6.0887 4.5842 55.0547 30.0302 2.3771 22.5431 7.8553 23.0505 9.5689 49.8593 13.0546 21.5632 1.8315 18.0122 39.7703 12.8366 169.1912 76.2749 4.6048 0.1373 21.3253 2.4399 12.7559 4.9509 0.4831 27.7709 12.9381 6.8836 0.2115 104.1440 541.6020 11.2342 35.9804 30.4354 6.2635 6.1891 22.3495 2.8660 33.3169 18.6598 19.4932 25.0098 70.8128 1.7040 4.1173 31.1997 27.9391 0.5637 39.7623 14.5140 64.6466
temp: 298.150 k
press: 1.00000 atm
elementType: 8 8 7 7 7 6 6 6 6 6 6 6 6 6 6 6 6 6 6 6 6 1 1 1 1 1 1 1 1 1 1 1 1 1 1 1 1 1 1 1
symmnumber: 1
zpe: 857845.6 jmol-1
zpe.correction: 0.326736 hartree
zpe.thermalcorrener: 0.346106 hartree
zpe.thermalcorrenthalpy: 0.347050 hartree
zpe.thermalcorrgfe: 0.276739 hartree
zpe.sumelectzpe: -934.316956 hartree
zpe.sumelectthermal: -934.297586 hartree
zpe.sumelectthermalent: -934.296642 hartree
zpe.sumelectthermalfe: -934.366953 hartree
dipole: 0.3530 -2.4194 -1.0718
dipole: 2.6696
quadrupole: -102.7164 -128.8758 -131.1107
quadrupole: -13.7723 5.9898 12.8584
quadrupole: 18.1846 -7.9748 -10.2098 -13.7723 5.9898 12.8584
hfenergy: -934.6436917 hartree
pointgroup: C01 [X(C16H19N3O2)]
dipole: -0.0514734 -0.9711711 0.3965888 debye
polarizability: 269.5500048|-11.1853897|196.5153988|2.3696957|0.2326474|124.7743763 unknown
InChI: InChI=1S/C16H19N3O2/c1-9(2)14-16(21)18-13(15(20)19-14)7-10-8-17-12-6-4-3-5-11(10)12/h3-6,8-9,13-14,17-19H,7H2,1-2H3
charge 0 multiplicity 1
40 atoms
O  2.516741 -1.71508 -2.282513
O  1.388875 3.03021 0.261612
N  2.918485 1.620628 -0.764641
N  0.984934 -0.294022 -1.27754
N  -2.722013 -2.162496 0.591343
C  3.391199 0.360769 -1.370028
C  0.552926 0.883177 -0.505485
C  4.497326 -0.343339 -0.509056
C  -0.057505 0.46462 0.8771
C  2.257103 -0.628924 -1.677922
C  1.657346 1.925602 -0.303889
C  -1.29713 -0.375544 0.716022
C  5.757002 0.545984 -0.396584
C  3.972091 -0.758213 0.882746
C  -2.622298 0.107803 0.355233
C  -1.402053 -1.76228 0.847521
C  -3.49496 -1.035336 0.284579
C  -3.155546 1.399743 0.09827
C  -4.865923 -0.922162 -0.036401
C  -4.52159 1.51892 -0.221754
C  -5.366489 0.370806 -0.29034
H  3.851668 0.594279 -2.35233
H  -0.245793 1.404093 -1.0705
H  4.755039 -1.256468 -1.079889
H  -0.27866 1.400826 1.421887
H  0.716953 -0.080083 1.447956
H  3.614172 2.360154 -0.624069
H  0.259613 -0.991593 -1.480062
H  5.569407 1.447089 0.219402
H  6.576757 -0.010738 0.091417
H  6.118482 0.870818 -1.390869
H  3.636006 0.122509 1.461826
H  4.770887 -1.256524 1.460863
H  3.127998 -1.466969 0.799749
H  -0.638126 -2.488329 1.121557
H  -3.06451 -3.119638 0.632478
H  -2.519736 2.290651 0.158273
H  -5.521109 -1.799038 -0.08612
H  -4.949015 2.507873 -0.420178
H  -6.425156 0.497821 -0.542463
