program: Gaussian 09
title: 000267562
version: EM64L-G09RevD.01
frameworkgroup: C1[X(C7H8FN5O4)]
method: RPBEPBE
basis: SDD
operation: Freq
keyword: #p
keyword: freq=noraman
keyword: PBEPBE/SDD
title: #p freq=noraman PBEPBE/SDD
converged: YES YES NO NO
title: Mulliken charges:
elementType: F O O O O N N N N N C C C C C C C H H H H H H H H
charge: -0.227588 -0.270418 -0.257051 -0.238476 -0.236360 -0.173949 -0.445974 -0.380707 -0.355829 0.051900 0.299458 -0.403138 0.332155 0.117391 -0.210070 -0.177225 0.154498 0.281895 0.248304 0.391690 0.326078 0.233109 0.212521 0.371022 0.356761
chargesum: 0.00000
title: Mulliken charges with hydrogens summed into heavy atoms:
elementType: F O O O O N N N N N C C C C C C C
charge: -0.227588 -0.270418 -0.257051 -0.238476 -0.236360 -0.173949 -0.054283 -0.009685 0.000932 0.051900 0.299458 0.127062 0.332155 0.117391 0.116008 0.268405 0.154498
polarizability: 2.13041679e+02 2.30405996e+01 1.36292800e+02 -8.43686407e+00 1.10463527e+01 6.46277925e+01
1716.lowfreq: -5.5415 -0.0004 -0.0004 -0.0002 2.3321 5.0284 32.2393 36.3612 59.9562
frequency: 32.1975 36.3421 59.9550 72.3021 85.4879 107.8934 146.6374 176.9163 185.1540 195.3863 243.0276 248.9500 328.4634 348.1099 367.3221 374.8740 380.8108 414.3498 471.2030 506.7005 518.3921 539.7772 587.2709 638.0757 697.0877 697.4705 731.4883 737.7302 757.1147 780.5547 786.5769 827.6464 838.8714 860.0226 907.8381 938.3868 952.7968 970.1129 1026.0013 1088.6301 1118.1857 1142.7251 1199.4957 1210.0178 1233.0789 1265.9130 1319.0386 1338.7439 1359.2064 1364.8563 1375.1507 1379.4807 1391.7148 1421.0284 1438.5213 1469.6346 1524.5965 1608.9344 1642.7388 1658.3163 1689.1078 3021.9644 3032.6042 3104.3740 3118.3210 3205.3344 3394.5493 3529.1310 3566.2447
redmass: 8.6785 9.3544 10.0048 6.5142 7.1754 8.6371 7.6472 7.6355 3.9552 10.0432 6.9483 9.4787 4.3797 7.5371 4.2278 10.0520 4.2758 4.1052 11.8651 5.1393 4.9457 4.9609 6.8330 1.3088 1.9840 8.5670 7.6751 3.6946 4.7571 2.5300 4.8009 3.8815 1.1566 5.2658 1.3302 3.6371 3.7641 2.2113 3.6144 3.0452 2.4866 2.0267 4.1293 1.2247 2.1140 2.6382 1.8041 2.2614 2.4220 1.7983 1.4446 1.6799 2.6900 1.1295 2.2798 1.0898 2.4733 7.9846 8.5950 6.3390 5.9171 1.0605 1.0601 1.1065 1.1029 1.0960 1.0767 1.0772 1.0785
irintensity: 0.6403 1.1968 3.7628 3.3010 1.9168 8.2277 0.8256 3.0740 2.3372 15.7705 13.5656 3.1383 3.3773 42.2195 2.3418 15.7108 3.2755 8.9498 1.0914 27.6428 8.1337 32.3728 6.8274 85.3523 0.0113 3.6763 15.5456 42.0480 37.7486 127.9608 15.8131 68.2962 102.1286 9.6677 38.4911 136.1143 83.0710 71.6580 22.9928 53.5257 2.5986 42.5150 20.8188 7.4905 30.9261 50.5941 1.6706 24.1591 102.5826 104.2359 55.0863 79.1102 178.3166 43.8374 205.5418 5.2046 519.9199 291.5435 144.8679 215.7934 644.0856 3.0712 45.9600 10.9870 6.7152 5.2891 79.0952 72.8488 105.2053
temp: 298.150 k
press: 1.00000 atm
elementType: 9 8 8 8 8 7 7 7 7 7 6 6 6 6 6 6 6 1 1 1 1 1 1 1 1
symmnumber: 1
zpe: 453306.5 jmol-1
zpe.correction: 0.172655 hartree
zpe.thermalcorrener: 0.188254 hartree
zpe.thermalcorrenthalpy: 0.189198 hartree
zpe.thermalcorrgfe: 0.127920 hartree
zpe.sumelectzpe: -944.771484 hartree
zpe.sumelectthermal: -944.755885 hartree
zpe.sumelectthermalent: -944.754941 hartree
zpe.sumelectthermalfe: -944.816219 hartree
dipole: 1.9602 -2.6167 -1.9715
dipole: 3.8178
quadrupole: -99.3741 -106.4474 -98.1711
quadrupole: -1.9969 -3.1704 3.3129
quadrupole: 1.9568 -5.1165 3.1598 -1.9969 -3.1704 3.3129
hfenergy: -944.9441394 hartree
pointgroup: C01 [X(C7H8F1N5O4)]
dipole: 0.7898676 0.9746356 0.8260581 debye
dipolederiv: -0.3698233 0.1063632 -0.1330035 0.0236334 -0.410997 0.2039349 0.0007339 0.1876475 -0.4919571 -0.6974437 0.1141105 0.0304869 -0.4242946 -0.8029315 -0.199243 -0.1793458 -0.1616127 -0.4188928 -0.6071486 0.1477259 0.0357588 0.148231 -1.0508267 -0.2115898 0.0321793 -0.2125784 -0.4255267 -1.6934012 0.2035932 -0.0090549 0.1328533 -0.4829027 -0.0241351 -0.0366873 -0.0194756 -0.3922598 -1.0069107 0.792663 0.1188244 0.2655551 -0.5815707 -0.0536376 0.0635995 -0.0566664 -0.1914746 -0.8703227 0.217783 0.075603 0.9231802 -0.9862817 -0.1639952 0.2458761 -0.1742193 -0.2108697 -1.728026 0.0486087 -0.0459036 -0.6586251 -0.4010389 -0.0900756 -0.2931695 -0.0498979 -0.3018754 -0.9604769 0.3891569 0.0896606 0.4086334 -0.6130957 -0.0638486 0.0916887 -0.0643373 -0.3510048 -1.5504933 0.4171677 0.0644518 -0.5563589 -0.3978341 -0.0621672 -0.250339 -0.0049914 -0.3209202 0.390873 -0.6741366 -0.0919595 -0.8380573 1.1850188 0.2007698 -0.249572 0.2477114 0.0040443 0.7724243 -0.3222157 -0.0717956 -0.0854295 -0.5594906 -0.1809404 0.0125497 -0.2018868 -0.0536694 0.2679238 0.0705937 0.0750128 0.241288 0.093462 -0.0496107 0.0971638 0.0415413 0.0850636 2.3922893 -0.3646158 -0.0210752 0.5084767 1.0510619 0.334578 0.2946349 0.234194 0.4345024 1.0693346 -0.1024993 0.0143474 -0.1749495 1.3371886 0.3325079 -0.0042324 0.3384455 0.3688316 0.8043912 -0.6032921 -0.1432427 -0.1092696 0.2971895 0.1006857 0.0145386 0.069095 -0.0258976 0.435673 -0.0789047 0.0820124 -0.0416687 0.4649192 -0.1808602 0.0092959 -0.240691 0.5375677 2.3076235 -0.2868308 0.02188 0.2376375 0.9292214 0.2052429 0.1953461 0.1752452 0.3943501 0.1607739 0.0151513 0.0651633 -0.0357704 0.0435247 -0.0412048 0.0342956 -0.0359545 0.0913784 -0.0101937 -0.0216263 -0.0443249 0.0722692 0.0359169 0.1035009 -0.0294851 0.0337117 0.0525936 0.4051808 -0.0281154 -0.0105116 0.0554706 0.2638848 -0.0110808 0.0422191 -0.0139807 0.3017116 0.1531404 -0.0223182 -0.0113286 -0.0424342 0.1136989 -0.0285995 -0.0172474 -0.0282378 0.1892536 0.0922556 0.0154607 -0.0254961 0.0939155 -0.038847 -0.0637005 -0.0076837 -0.0378838 -0.0022772 -0.117305 -0.0650705 -0.0543996 -0.126265 0.0057891 0.0051333 -0.0403791 0.0336634 0.0504988 0.196014 0.04823 0.0059144 0.0679325 0.2158528 -0.0375499 0.012522 -0.0383475 0.3339671 0.1636477 -0.0169825 -0.01702 -0.0859534 0.2890881 -0.0241145 -0.0385016 -0.0204941 0.3428626 unknown
polarizability: 214.1137025|-21.5106228|133.1444219|-0.0704227|17.8941046|66.7041472 unknown
InChI: InChI=1S/C7H8FN5O4/c8-1-2-13(12-17)7(16)10-4-3-9-6(15)11-5(4)14/h3,9-11H,1-2H2
charge 0 multiplicity 1
25 atoms
F  3.610148 1.813736 -1.602848
O  1.072618 1.621347 0.807184
O  -1.702242 -2.296462 -0.658718
O  -5.32281 0.61315 0.047554
O  3.683474 -2.055432 -0.095566
N  2.480946 -0.192956 0.284363
N  0.134894 -0.3962 0.055009
N  -3.493685 -0.825905 -0.299676
N  -3.135289 1.377266 0.424333
N  2.508337 -1.561008 -0.022949
C  -1.227776 -0.046769 0.088778
C  3.709766 0.594661 0.507289
C  1.17631 0.429512 0.403568
C  -2.120025 -1.149335 -0.31814
C  -1.755865 1.177436 0.444765
C  4.444846 0.927466 -0.795886
C  -4.082539 0.40505 0.056565
H  3.40334 1.518764 1.021877
H  4.384538 0.003862 1.154481
H  0.335477 -1.365499 -0.239544
H  -1.122045 2.011718 0.747083
H  4.654384 0.030729 -1.401509
H  5.379259 1.471076 -0.567925
H  -4.145711 -1.566786 -0.576644
H  -3.525456 2.283981 0.687258
