program: Gaussian 09
title: 000267633
version: EM64L-G09RevD.01
frameworkgroup: C1[X(C23H29NO4S)]
method: RPBEPBE
basis: SDD
operation: Freq
keyword: #p
keyword: freq=noraman
keyword: PBEPBE/SDD
title: #p freq=noraman PBEPBE/SDD
converged: YES YES NO NO
title: Mulliken charges:
elementType: S O O O O N C C C C C C C C C C C C C C C C C C C C C C C H H H H H H H H H H H H H H H H H H H H H H H H H H H H H
charge: 0.895679 -0.364242 -0.250091 -0.557833 -0.563197 -0.470891 -0.068892 0.235874 -0.442671 -0.462757 -0.409136 -0.409570 -0.382305 0.433680 -0.804311 -0.387486 -0.358518 0.272416 -0.248051 -0.253301 -0.240634 0.491042 -0.437545 -0.327736 -0.089977 -0.234721 -0.248395 -0.506136 -0.635481 0.209315 0.197611 0.229459 0.217390 0.212854 0.191650 0.199179 0.200569 0.191171 0.187622 0.201465 0.278851 0.238077 0.211721 0.227438 0.240686 0.224965 0.226147 0.229735 0.330991 0.236065 0.311779 0.289876 0.283920 0.259111 0.257236 0.255714 0.256812 0.227773
chargesum: 0.00000
title: Mulliken charges with hydrogens summed into heavy atoms:
elementType: S O O O O N C C C C C C C C C C C C C C C C C C C C C C C
charge: 0.895679 -0.364242 -0.250091 -0.557833 -0.563197 -0.139900 0.140424 0.235874 -0.015601 -0.032512 -0.018307 -0.017829 0.006782 0.433680 -0.075663 -0.160048 -0.117832 0.272416 -0.023086 -0.027154 -0.010899 0.491042 -0.201480 -0.015956 -0.089977 0.055156 0.035525 0.010211 0.104818
polarizability: 3.98365139e+02 -3.12948419e+00 2.84869761e+02 -2.35007913e+01 7.55720246e+00 2.30801301e+02
1716.lowfreq: -13.3715 -3.8980 -0.0012 0.0014 0.0021 4.3272 14.1200 18.2541 24.6920
frequency: 10.4171 17.8705 24.6664 30.9109 37.6877 42.8849 46.6351 55.9383 65.2038 84.2117 88.6191 97.5759 129.3673 139.1505 160.5817 185.1731 191.0668 207.1573 213.7010 223.0950 229.4548 230.4837 249.7965 261.4013 279.7876 288.2282 311.5708 316.4130 326.3297 329.8891 347.7734 361.2512 380.4077 404.3493 413.4244 415.7578 430.3226 444.7956 471.7386 494.5627 505.1818 520.5616 551.2816 563.5781 606.1629 616.9580 621.4648 641.5235 649.2141 701.0474 703.6013 708.5939 721.4592 745.9051 760.2103 779.0868 785.9152 788.2608 797.2793 807.3002 836.2116 846.0657 853.6032 861.4110 866.3717 880.4644 894.6348 907.6654 917.7832 922.9321 928.0593 961.6198 974.0137 978.6509 979.2365 990.3281 990.9029 991.9756 996.3846 1005.0639 1024.0309 1039.8882 1040.5075 1053.4038 1057.1483 1058.9271 1064.7842 1066.6187 1090.0807 1098.1339 1114.4717 1120.8748 1131.9125 1153.3812 1173.9397 1181.6364 1184.7640 1188.3714 1196.2917 1230.5025 1235.6161 1244.4522 1248.2450 1255.0323 1263.9023 1269.5004 1295.6386 1298.1562 1308.1598 1319.6629 1320.7284 1336.5420 1338.1725 1340.4775 1365.5417 1374.6647 1378.9648 1387.4607 1394.2399 1407.7093 1410.8112 1434.8207 1459.1076 1462.1806 1463.0289 1463.9097 1467.2270 1469.5130 1474.3939 1477.9854 1481.5384 1482.3640 1491.2951 1505.7425 1590.7824 1596.1073 1602.1291 1613.3159 1660.3408 2950.3275 2962.2795 2963.8299 2965.5008 2978.3874 2983.8435 2992.6900 3001.5574 3026.2988 3027.9698 3036.5388 3043.4931 3046.9848 3054.7205 3087.1772 3092.4217 3102.5201 3124.1218 3126.7821 3129.7146 3131.0487 3137.9671 3144.5156 3151.0763 3152.6145 3157.7216 3166.1483 3193.9246 3540.8859
redmass: 4.6542 4.8969 2.8995 3.5481 3.3764 4.1759 4.2305 4.1575 4.7099 5.3097 4.9294 7.1392 4.1659 5.9263 5.4052 4.1719 1.5233 2.4058 2.6601 3.6933 4.0333 3.9227 2.1101 2.1748 1.9769 5.0389 2.3524 5.9045 3.0820 4.1502 3.5285 5.7108 5.1595 2.8508 2.9807 2.8858 2.9847 3.1449 3.3333 2.1693 3.8383 3.7957 4.3151 4.1670 4.7868 6.3651 5.8581 4.9575 1.3508 3.1777 5.8116 2.3132 3.5066 4.5413 2.0743 1.2119 1.5689 9.0711 2.3459 3.3074 1.4035 2.2909 1.2577 2.2826 1.8474 1.8546 1.4493 5.1228 1.9808 1.7073 1.9418 1.3578 1.7233 3.7313 1.4828 4.8345 5.6697 1.3310 1.3135 2.0299 2.6814 2.7194 1.4317 1.2883 2.4004 1.5553 1.7072 2.6024 1.5721 1.7531 2.4257 1.3412 2.5699 2.6077 1.0587 2.4064 1.2007 1.5806 1.1709 2.0363 1.2485 1.7172 1.2634 1.3396 2.0376 1.2217 1.2717 1.3463 1.2612 1.3557 1.4057 1.4608 1.4538 1.5091 1.4471 4.7254 7.1973 1.1996 1.1642 4.5851 1.1341 2.2315 1.0736 1.0867 1.0345 1.0798 1.0756 1.0864 2.1303 1.1108 2.0090 1.0507 1.0975 2.4376 6.1287 6.2435 5.8070 6.1234 8.0107 1.0810 1.0633 1.0650 1.0618 1.0612 1.0628 1.0361 1.0385 1.0974 1.0943 1.1012 1.0569 1.1010 1.1012 1.0974 1.0972 1.1019 1.0843 1.0895 1.0997 1.0875 1.1097 1.0920 1.0911 1.0955 1.0956 1.1013 1.0948 1.0762
irintensity: 0.2642 3.5937 0.0874 0.3819 1.0600 0.3007 1.8007 1.2411 0.0552 0.5160 2.4503 3.4125 1.1627 0.8636 2.8132 4.4926 0.0200 0.3281 0.9679 3.9362 3.7304 25.5396 0.9572 2.5804 0.8527 10.9329 0.7960 10.4938 2.0686 6.6329 6.6945 4.8151 1.4260 0.3557 0.0677 1.7830 0.2335 8.3286 29.5843 2.5906 3.7212 30.4414 66.9056 72.5665 3.0101 0.0815 4.8226 6.3679 28.8822 50.8668 15.1719 38.7166 1.5057 44.2548 27.4789 1.9050 2.0511 94.2598 3.7881 26.7072 32.5541 6.7352 0.1186 18.0367 23.4240 18.4832 13.3044 79.0625 1.7652 2.8590 1.7482 1.4518 108.2376 143.4568 15.8154 15.9208 1.3110 1.7169 0.2691 86.4637 13.4475 126.5403 11.2069 12.9330 32.5262 0.3446 46.9574 9.1621 29.7657 84.7290 3.5707 49.9709 427.4131 87.7542 0.0312 103.8075 2.1754 0.5379 7.4891 9.9263 0.3911 14.0332 12.3839 1.3795 6.8615 2.6052 22.5449 16.3323 1.9644 1.5525 0.3494 6.9257 6.9097 2.3974 11.6433 231.4577 13.4081 36.0455 31.1387 21.2733 1.6912 15.0285 8.1788 6.4641 19.2246 18.1164 4.8746 16.3941 1.4632 1.6808 14.7737 13.2499 11.0363 762.5347 1.7093 68.4486 154.2661 2.9749 163.2985 11.3109 31.9023 47.2807 32.8795 13.0517 34.9769 20.4538 15.3237 70.7808 78.3716 37.8011 10.1650 33.7899 78.1842 9.1810 30.4593 3.4211 1.8743 12.5213 10.4767 0.7908 7.0953 22.6041 1.7312 41.1574 9.3103 16.7578 6.0292 31.4873
temp: 298.150 k
press: 1.00000 atm
elementType: 16 8 8 8 8 7 6 6 6 6 6 6 6 6 6 6 6 6 6 6 6 6 6 6 6 6 6 6 6 1 1 1 1 1 1 1 1 1 1 1 1 1 1 1 1 1 1 1 1 1 1 1 1 1 1 1 1 1
symmnumber: 1
zpe: 1243696.4 jmol-1
zpe.correction: 0.473699 hartree
zpe.thermalcorrener: 0.503048 hartree
zpe.thermalcorrenthalpy: 0.503992 hartree
zpe.thermalcorrgfe: 0.409769 hartree
zpe.sumelectzpe: -1645.258353 hartree
zpe.sumelectthermal: -1645.229005 hartree
zpe.sumelectthermalent: -1645.228060 hartree
zpe.sumelectthermalfe: -1645.322283 hartree
dipole: -6.4489 0.9534 -4.6226
dipole: 7.9916
quadrupole: -204.1492 -176.3369 -180.1792
quadrupole: 19.2461 -31.4274 -1.8315
quadrupole: -17.2608 10.5515 6.7093 19.2461 -31.4274 -1.8315
hfenergy: -1645.7320522 hartree
pointgroup: C01 [X(C23H29N1O4S1)]
dipole: -2.550002 0.5136764 -1.7661417 debye
polarizability: 397.4478568|-5.1811842|284.4153487|-25.7391407|10.3272511|232.1729951 unknown
InChI: InChI=1S/C23H29NO4S/c1-3-29(26,27)21-16-14-20(15-17-21)24-22(25)28-23(2,18-10-6-4-7-11-18)19-12-8-5-9-13-19/h4,6-7,10-11,14-17,19,24H,3,5,8-9,12-13H2,1-2H3
charge 0 multiplicity 1
58 atoms
S  6.548392 -0.58563 0.074487
O  -1.739712 -0.521694 0.292593
O  -0.240343 0.932679 1.41869
O  7.015719 0.096226 1.490511
O  7.073216 -2.06799 -0.395145
N  0.463918 -0.834968 0.007615
C  -4.150372 -0.768769 0.277767
C  -2.992661 0.141794 0.830838
C  -4.192621 -0.839847 -1.272314
C  -4.137321 -2.202486 0.874091
C  -5.393285 -1.677745 -1.773134
C  -5.334124 -3.044089 0.366672
C  -5.379985 -3.103241 -1.176873
C  -3.107034 1.568489 0.262378
C  -2.944465 0.128444 2.376814
C  -3.968969 2.504515 0.888486
C  -2.424582 1.963659 -0.915089
C  -0.478234 -0.034135 0.658726
C  -4.137824 3.802425 0.357486
C  -2.58474 3.262592 -1.443506
C  -3.443727 4.18963 -0.810872
C  1.873433 -0.727557 0.054867
C  2.624178 -1.6738 -0.700365
C  2.545242 0.264825 0.823891
C  4.662281 -0.620537 0.041629
C  4.030249 -1.626827 -0.708321
C  3.954028 0.310593 0.818431
C  7.062487 0.659306 -1.33744
C  8.585189 0.738032 -1.366542
H  -5.084018 -0.266908 0.616112
H  -3.249713 -1.297017 -1.633524
H  -4.245728 0.176948 -1.701361
H  -4.167116 -2.166478 1.978718
H  -3.188013 -2.69887 0.590133
H  -6.338631 -1.171545 -1.485708
H  -5.380318 -1.721937 -2.879496
H  -5.276827 -4.06506 0.79163
H  -6.279057 -2.595723 0.739208
H  -4.487333 -3.647635 -1.549397
H  -6.268054 -3.672291 -1.513773
H  -2.293119 0.929179 2.755743
H  -2.5568 -0.838021 2.739081
H  -3.960056 0.256965 2.791661
H  -4.50763 2.229498 1.801926
H  -1.76253 1.252905 -1.420411
H  -4.805769 4.511192 0.85986
H  -2.039501 3.549732 -2.349681
H  -3.568423 5.198281 -1.220066
H  0.065106 -1.58484 -0.561602
H  2.105327 -2.451152 -1.274301
H  1.963044 0.974408 1.414276
H  4.62718 -2.366058 -1.252762
H  4.493738 1.039866 1.432121
H  6.565458 1.600355 -1.052064
H  6.612573 0.226439 -2.245229
H  9.028103 -0.249063 -1.583892
H  8.980359 1.099366 -0.401557
H  8.902116 1.442973 -2.157214
