program: Gaussian 09
title: 000267568
version: EM64L-G09RevD.01
frameworkgroup: C1[X(C14H13NO5)]
method: RPBEPBE
basis: SDD
operation: Freq
keyword: #p
keyword: freq=noraman
keyword: PBEPBE/SDD
title: #p freq=noraman PBEPBE/SDD
converged: YES YES NO NO
title: Mulliken charges:
elementType: O O O O O N C C C C C C C C C C C C C C H H H H H H H H H H H H H
charge: -0.290770 -0.294623 -0.253549 -0.195049 -0.193330 0.007089 0.389842 -0.172488 0.053592 0.363915 0.262446 -0.541838 -0.306982 -0.178308 -0.373844 0.266599 -0.529061 0.262306 -0.749232 -0.748553 0.267140 0.265410 0.229940 0.242918 0.248070 0.235215 0.223744 0.246924 0.257954 0.248800 0.247098 0.243019 0.265607
chargesum: 0.00000
title: Mulliken charges with hydrogens summed into heavy atoms:
elementType: O O O O O N C C C C C C C C C C C C C C
charge: -0.290770 -0.294623 -0.253549 -0.195049 -0.193330 0.007089 0.389842 -0.172488 0.053592 0.363915 0.262446 -0.274698 -0.041572 0.051632 -0.130926 0.266599 0.177968 0.262306 0.004446 0.007170
polarizability: 2.36210240e+02 1.53868879e+01 2.15233536e+02 -4.74483409e-01 1.78637953e+00 1.04798154e+02
1716.lowfreq: -9.0725 0.0000 0.0005 0.0005 1.3263 6.5265 39.8059 51.9352 52.8977
frequency: 39.7938 51.9292 52.8912 58.2462 65.9294 75.2580 86.3748 91.7413 107.9356 142.3201 158.9973 179.8873 203.2814 216.8143 244.4982 275.8726 280.1069 310.6081 334.0392 362.1506 398.7585 433.4637 450.6416 483.8005 518.0234 530.7645 532.4861 547.4466 573.2087 582.4547 630.7675 647.5748 687.5967 696.7161 737.6610 754.1245 797.1756 806.7329 838.3706 859.4871 881.0792 899.9827 938.5170 983.1063 986.2830 992.2295 1004.1379 1033.1898 1037.5143 1038.6250 1061.8956 1090.3703 1112.6556 1138.6976 1157.5144 1160.5442 1168.8676 1193.6719 1235.9181 1296.8648 1352.3919 1363.7972 1377.0492 1380.2456 1382.7643 1420.7005 1442.6839 1450.9307 1452.4069 1453.2011 1454.0221 1461.9707 1469.3044 1473.6187 1489.2811 1559.3481 1589.1356 1629.2541 1693.4684 1699.1229 2971.0010 3008.5967 3008.7994 3065.2558 3099.2248 3100.7311 3128.9297 3133.6599 3143.3917 3143.7444 3154.3310 3175.9703 3179.8860
redmass: 4.8519 3.8611 4.3704 3.1462 3.4841 3.7282 1.2758 6.0488 1.1267 5.0097 5.8053 3.7038 2.1434 2.4921 4.7636 3.5679 3.2703 8.5497 3.9216 4.5097 6.7258 4.1271 6.2807 4.7210 5.4477 4.0780 3.4867 3.2624 5.8649 5.9961 4.6165 5.7460 4.6884 6.3981 6.6189 6.0118 2.6570 2.3034 2.5067 4.6908 2.5750 6.4218 1.4491 2.1495 2.0760 1.3673 6.6745 2.4941 1.6619 1.9895 3.7618 5.6038 1.2550 1.9082 1.9498 1.5566 2.6213 1.6496 2.0956 5.4424 6.3474 2.6724 1.8413 1.2715 1.2704 3.5683 1.5799 1.0554 1.0579 1.0539 1.0519 2.3276 1.0662 1.1320 4.8120 8.2215 6.2697 8.7439 10.6626 10.6718 1.0326 1.0373 1.0369 1.1045 1.0958 1.0959 1.0893 1.1003 1.1020 1.1019 1.0899 1.0995 1.0913
irintensity: 0.3727 2.7356 1.1581 8.5449 0.2156 5.7171 0.3738 2.1343 0.2490 0.6444 2.7479 2.5820 0.3295 0.6221 1.5180 0.3836 5.5982 3.2587 5.1963 1.0352 1.7382 2.3512 2.4782 5.7184 21.5246 1.0870 1.1757 5.6732 15.2178 21.0826 7.4396 15.5170 2.1168 2.3887 0.6526 20.5541 90.8828 7.7987 1.2774 65.3815 27.3657 79.7442 0.5459 139.7695 32.9537 1.1966 95.0527 84.1427 7.6536 31.3474 123.3717 101.2643 0.0583 387.6340 271.4770 120.4124 138.2218 33.1903 5.2318 129.8227 49.8777 32.4690 106.8071 37.2715 32.8269 24.4929 25.5862 19.7588 19.9612 22.1596 21.1041 72.5926 13.2676 22.3036 44.9580 18.6338 32.8822 109.2036 97.9536 233.5115 67.4976 1.7253 1.4337 34.8178 6.4126 7.6289 15.5540 18.8360 11.0723 10.1072 11.2732 20.2667 1.0757
temp: 298.150 k
press: 1.00000 atm
elementType: 8 8 8 8 8 7 6 6 6 6 6 6 6 6 6 6 6 6 6 6 1 1 1 1 1 1 1 1 1 1 1 1 1
symmnumber: 1
zpe: 640993.9 jmol-1
zpe.correction: 0.244142 hartree
zpe.thermalcorrener: 0.263570 hartree
zpe.thermalcorrenthalpy: 0.264514 hartree
zpe.thermalcorrgfe: 0.195030 hartree
zpe.sumelectzpe: -970.707877 hartree
zpe.sumelectthermal: -970.688449 hartree
zpe.sumelectthermalent: -970.687505 hartree
zpe.sumelectthermalfe: -970.756989 hartree
dipole: -1.6711 -0.7374 -2.9157
dipole: 3.4406
quadrupole: -96.8733 -88.4285 -128.8533
quadrupole: -1.8494 -0.5042 2.9350
quadrupole: 7.8450 16.2899 -24.1349 -1.8494 -0.5042 2.9350
hfenergy: -970.9520191 hartree
pointgroup: C01 [X(C14H13N1O5)]
dipole: 0.5977593 -0.3528048 1.1621313 debye
polarizability: 231.585442|-17.6330057|219.7177508|1.1248044|-4.4457289|104.9387368 unknown
InChI: InChI=1S/C14H13NO5/c1-8(16)19-11-7-12(18-3)14(20-9(2)17)10-5-4-6-15-13(10)11/h4-7H,1-3H3
charge 0 multiplicity 1
33 atoms
O  2.70058 0.238253 0.354475
O  -2.833164 -0.933458 0.369347
O  1.855302 -2.367651 0.514786
O  3.136279 -0.774711 -1.724562
O  -3.261379 -0.279891 -1.849415
N  -1.99745 1.738185 0.189659
C  0.3851 1.017041 0.211221
C  -1.037398 0.74226 0.226466
C  1.311438 -0.061637 0.288827
C  -1.454064 -0.629239 0.288255
C  0.867971 -1.392924 0.388134
C  -0.533904 -1.670071 0.371661
C  0.787331 2.391203 0.123757
C  -0.189597 3.384702 0.069212
C  -1.573004 3.012551 0.113983
C  3.559357 -0.251164 -0.683077
C  1.442442 -3.775216 0.478196
C  -3.688593 -0.53824 -0.715205
C  4.995121 -0.020335 -0.278952
C  -5.117552 -0.53955 -0.236302
H  -0.910314 -2.69448 0.424681
H  1.853676 2.63378 0.107132
H  0.082201 4.442372 -0.000933
H  -2.352319 3.782965 0.085404
H  2.379521 -4.346346 0.54202
H  0.923855 -4.011226 -0.469578
H  0.794091 -4.024565 1.339762
H  5.652882 -0.139847 -1.151922
H  5.27612 -0.761626 0.490852
H  5.120719 0.980201 0.16574
H  -5.313669 -1.412009 0.407922
H  -5.804082 -0.530129 -1.09515
H  -5.280994 0.368105 0.372302
