program: Gaussian 09
title: 000022734
version: EM64L-G09RevD.01
frameworkgroup: C1[X(C8H16O2)]
method: RPBEPBE
basis: SDD
operation: Freq
keyword: #pfreq=noraman
keyword: PBEPBE/SDD
title: #p freq=noraman PBEPBE/SDD
converged: YES YES NO NO
title: Mulliken charges:
elementType: O O C C C C C C C C H H H H H H H H H H H H H H H H
charge: -0.418960 -0.230749 0.047941 -0.425333 -0.430774 -0.401035 -0.503101 -0.715702 -0.715605 0.167268 0.178323 0.215152 0.222944 0.210137 0.206502 0.198786 0.202043 0.261938 0.251345 0.223033 0.219406 0.215606 0.218066 0.216660 0.210519 0.375588
chargesum: 0.00000
title: Mulliken charges with hydrogens summed into heavy atoms:
elementType: O O C C C C C C C C
charge: -0.043371 -0.230749 0.226263 0.012763 -0.014135 -0.000207 0.010182 -0.057655 -0.070360 0.167268
polarizability: 1.09934800e+02 -2.24362141e+00 8.78356090e+01 -5.09952185e-01 -4.79629696e+00 7.84141698e+01
1716.lowfreq: -23.8712 -5.6832 -0.0010 -0.0009 -0.0007 6.7411 13.1801 36.8708 57.9039
frequency: 9.2633 36.3521 57.7440 93.4963 102.9300 133.0863 212.6148 223.6175 239.5599 269.2834 288.5614 332.2297 451.7999 475.5755 501.8580 524.3940 588.1936 637.0385 737.1419 740.7795 788.1050 822.3458 862.7113 906.6832 968.5742 977.9886 1005.3228 1024.5623 1036.4397 1053.3497 1088.8142 1111.3776 1152.5694 1154.7115 1175.3763 1234.8660 1249.9501 1267.1354 1274.1334 1275.9236 1317.9604 1332.6516 1351.2728 1352.8146 1372.0874 1388.6985 1389.5482 1437.9299 1461.8450 1471.4183 1476.8168 1482.2267 1486.4647 1487.5290 1497.1637 1668.6320 2931.3343 2969.4909 2974.8535 2979.2365 2981.6807 2984.7463 2994.2208 3016.4707 3022.3556 3034.0876 3057.7040 3068.1939 3072.3526 3072.9579 3076.1901 3511.9385
redmass: 7.5709 2.8472 2.6740 2.3105 3.5591 1.3764 1.4183 2.2002 1.5886 2.7663 2.1750 2.7454 2.5872 2.9622 1.8667 2.2006 3.9349 1.3469 2.1094 1.1850 1.2894 1.5397 3.6863 1.8722 2.3647 1.5271 1.3822 1.8850 2.2949 2.1609 2.5186 1.7783 1.7943 2.2387 1.5387 1.3798 1.3313 1.2005 1.1285 1.3016 1.4558 1.5248 1.5652 1.3380 1.7730 1.2238 1.2126 1.0835 1.0718 1.0530 1.0548 1.0656 1.0536 1.0566 1.0724 8.1373 1.0814 1.0583 1.0384 1.0442 1.0569 1.0612 1.0601 1.1005 1.0984 1.0964 1.1000 1.0993 1.0993 1.0990 1.0997 1.0639
irintensity: 0.8436 0.0281 0.0955 0.2845 1.1248 0.0550 0.7422 1.1893 0.0595 1.3830 0.0694 1.3682 1.8258 20.9456 24.5354 20.7165 18.1035 125.4649 5.7598 5.9666 8.7790 11.2403 3.4468 3.0141 39.0234 0.6010 3.7125 100.9799 35.6485 100.4098 22.1283 1.9233 1.9227 10.9534 6.1469 3.1013 0.6427 0.8283 2.6813 15.4593 29.0522 11.9467 3.6678 2.9913 28.8796 21.6712 10.3051 29.7773 2.8411 5.0326 9.0405 23.9433 6.6373 11.1463 8.2797 207.0358 25.8581 34.2611 26.0592 45.7331 8.2534 15.9991 36.1572 19.3609 32.0391 9.5614 34.2060 52.5213 34.0563 96.7414 47.8293 17.9116
temp: 298.150 k
press: 1.00000 atm
elementType: 8 8 6 6 6 6 6 6 6 6 1 1 1 1 1 1 1 1 1 1 1 1 1 1 1 1
symmnumber: 1
zpe: 596992.4 jmol-1
zpe.correction: 0.227382 hartree
zpe.thermalcorrener: 0.240016 hartree
zpe.thermalcorrenthalpy: 0.240960 hartree
zpe.thermalcorrgfe: 0.186010 hartree
zpe.sumelectzpe: -464.077952 hartree
zpe.sumelectthermal: -464.065318 hartree
zpe.sumelectthermalent: -464.064374 hartree
zpe.sumelectthermalfe: -464.119324 hartree
dipole: 0.6329 1.0212 -1.0071
dipole: 1.5677
quadrupole: -59.1572 -66.2522 -64.8758
quadrupole: -3.0095 2.2362 3.2896
quadrupole: 4.2712 -2.8238 -1.4474 -3.0095 2.2362 3.2896
hfenergy: -464.3053345 hartree
pointgroup: C01 [X(C8H16O2)]
dipole: 0.2560317 0.4162478 -0.3763041 debye
dipolederiv: -0.9780204 0.4486723 -0.3226151 0.4210223 -0.6104045 0.1160159 -0.2753255 0.1056569 -0.4936857 -0.7002493 -0.1440048 0.115963 0.0725845 -0.710227 0.3067312 -0.0205913 0.3253769 -0.5474309 0.0899373 0.0135043 0.0069663 0.0272343 0.1193911 0.0382137 -0.014836 0.0229272 0.124142 0.0201377 0.0080717 0.027533 -0.0091662 0.0372127 0.0530299 0.024493 0.0536073 0.1081647 0.0865064 -0.0052888 0.0040961 -0.0157688 0.0446493 0.0028687 0.0230256 0.034489 0.0881292 0.0241272 -0.0030743 -0.000088 -0.015185 0.0850062 0.0380157 0.0292708 0.0366703 0.1210188 -0.3044388 -0.0345766 0.0746836 -0.1436517 0.0189256 0.1200735 0.219981 0.1164546 0.0440345 0.0862162 -0.0176482 -0.0104917 -0.0186276 -0.0032602 -0.0638135 -0.0131949 -0.0626164 -0.0484792 -0.0914281 0.0185671 0.038945 0.0336446 0.0732891 0.0146902 0.0068837 0.019983 0.0711395 1.5072682 -0.1677768 0.059014 -0.2659576 0.9485361 -0.5819648 0.0617444 -0.5811282 0.6246657 0.0265038 -0.0101024 -0.0178715 -0.0149186 -0.0219483 -0.0772116 -0.0144102 -0.0734758 -0.2005656 0.0446232 0.0143706 -0.0237239 0.0401563 0.0718422 -0.0559682 -0.0162543 -0.0430949 -0.1380517 0.0630532 -0.0373437 -0.005319 -0.0329533 -0.1413095 -0.0081721 -0.0286711 -0.012073 0.0709992 -0.1485893 -0.0727312 0.1226914 -0.058538 0.0622905 -0.0174151 0.09916 -0.0278197 -0.0182361 -0.0369731 0.118733 -0.1255506 0.1154891 -0.0369834 0.04743 -0.1190281 0.0309805 -0.0441874 0.0030849 -0.0890718 0.0092908 -0.0696336 -0.1830876 0.0139533 0.0052663 -0.0091558 0.0714899 0.0196884 0.01876 0.0189451 0.0049879 0.0763994 -0.0804736 0.001475 -0.0458649 -0.17421 0.0905747 0.0006425 0.0067646 0.0233958 -0.0863228 -0.0131359 -0.0231857 -0.028916 0.0937035 0.0638401 -0.0040205 0.0181071 0.0112793 0.0996085 -0.0330261 -0.0381837 -0.0126406 -0.0829651 -0.0472346 0.065392 -0.1019905 0.0978013 0.0570552 0.0833108 -0.0956531 0.0502265 -0.0108723 -0.1159717 0.0051468 0.1213415 -0.0218321 0.0985704 0.0259978 0.1079712 0.004942 0.0044614 0.072292 -0.0651775 -0.0052967 -0.0704654 -0.1941449 -0.0244945 0.0039052 0.0138069 0.0788313 0.0482898 -0.0862037 0.0065667 -0.1338612 -0.1298253 -0.0178158 0.0103199 -0.0280811 0.0710726 -0.077539 0.11633 -0.0520374 0.1489497 -0.0296991 0.0660181 -0.0793324 0.0846964 0.0448184 0.0695953 -0.0166194 -0.0361005 -0.0088877 0.0794172 -0.0451554 0.0389407 -0.0641725 -0.1710585 0.1847058 -0.0745507 0.0701766 -0.1170983 0.2750191 0.0922976 0.1062294 0.0892214 0.3130719 unknown
polarizability: 109.9278888|-2.2450157|88.2206805|-0.1638816|-4.435723|78.0360092 unknown
InChI: InChI=1S/C8H16O2/c1-3-7(4-2)5-6-8(9)10/h7,9H,3-6H2,1-2H3
charge 0 multiplicity 1
26 atoms
O  -3.675746 0.606897 -0.574189
O  -2.931423 -1.168204 0.721544
C  1.255515 -0.213024 -0.423411
C  -0.14177 -0.504014 0.19005
C  1.62555 1.300248 -0.417432
C  2.32032 -1.102474 0.279131
C  -1.295625 0.245119 -0.503508
C  1.711666 1.951629 0.982288
C  3.730869 -1.035141 -0.345602
C  -2.664081 -0.208365 -0.033757
H  1.221232 -0.52815 -1.49141
H  -0.141032 -0.258398 1.269682
H  -0.340875 -1.591263 0.132244
H  2.594676 1.431434 -0.936818
H  0.886469 1.855202 -1.029329
H  1.965378 -2.152846 0.24953
H  2.376835 -0.831909 1.352933
H  -1.234373 1.33858 -0.350972
H  -1.256558 0.095482 -1.602053
H  2.490611 1.475999 1.605594
H  0.753718 1.876292 1.529004
H  1.963052 3.024756 0.897673
H  4.18103 -0.030956 -0.242495
H  4.412926 -1.755117 0.143071
H  3.699426 -1.280667 -1.42438
H  -4.560887 0.27589 -0.259588
