program: Gaussian 09
title: 000267593
version: EM64L-G09RevD.01
frameworkgroup: C1[X(C15H22N4O6)]
method: RPBEPBE
basis: SDD
operation: Freq
keyword: #p
keyword: freq=noraman
keyword: PBEPBE/SDD
title: #p freq=noraman PBEPBE/SDD
converged: YES YES NO NO
title: Mulliken charges:
elementType: O O O O O O N N N N C C C C C C C C C C C C C C C H H H H H H H H H H H H H H H H H H H H H H
charge: -0.465823 -0.288110 -0.264279 -0.483196 -0.249313 -0.382327 -0.343651 -0.357609 -0.367417 -0.505306 -0.271709 -0.102109 0.257995 -0.201208 -0.692947 -0.375957 0.158089 0.346985 -0.479191 0.467688 -0.372938 -0.366101 -0.224528 -0.226421 -0.229708 0.260756 0.228024 0.278667 0.335641 0.365273 0.248665 0.206723 0.227462 0.228171 0.240582 0.378004 0.238991 0.230390 0.373270 0.385545 0.236352 0.258028 0.298813 0.305209 0.230701 0.230960 0.232865
chargesum: 0.00000
title: Mulliken charges with hydrogens summed into heavy atoms:
elementType: O O O O O O N N N N C C C C C C C C C C C C C C C
charge: -0.087820 -0.288110 -0.264279 -0.097650 -0.249313 -0.382327 -0.008010 0.007664 0.005854 0.098716 -0.010953 0.125914 0.257995 0.077459 -0.010097 0.092796 0.158089 0.346985 -0.009810 0.467688 -0.136586 -0.108074 0.006173 0.004539 0.003157
polarizability: 2.50605839e+02 7.81900996e+00 2.06659088e+02 4.90143881e+00 -2.09901975e+01 1.75037167e+02
1716.lowfreq: -20.5662 -8.5224 -6.3911 -0.0007 -0.0005 -0.0003 9.0732 14.5392 19.4292
frequency: -11.3557 14.5138 18.4870 31.7329 32.9900 41.1559 50.7372 59.7530 90.7149 94.3883 104.8168 126.2842 147.1198 148.5017 158.6821 177.3679 193.0041 202.1825 214.8276 222.8824 248.9065 269.7215 271.6508 290.3366 300.6148 327.8305 331.7628 350.8459 359.6190 381.1722 402.1005 431.3611 445.2399 509.6966 569.8756 591.4926 599.5130 616.6392 617.8496 635.3657 676.7030 689.4721 697.8138 702.9907 712.4822 718.1942 740.4801 750.8840 758.1036 774.9848 798.9550 816.4503 825.8513 849.4516 856.8574 862.3801 864.3936 907.9157 922.1513 934.7946 946.6417 968.9714 970.5922 981.1766 987.9350 990.8148 1001.7076 1020.3277 1027.0128 1035.6651 1064.1617 1083.7594 1092.1839 1109.3498 1140.4196 1145.2059 1174.9667 1189.3942 1191.6474 1199.0974 1221.3616 1222.4157 1235.1578 1263.1717 1270.1415 1271.1401 1283.6120 1284.1096 1295.4600 1320.4574 1330.3466 1335.2062 1349.5107 1357.1448 1386.7380 1388.8220 1389.5083 1406.6249 1443.1625 1456.6830 1458.3966 1463.3596 1471.3231 1476.6777 1485.8647 1488.6709 1500.2265 1594.7083 1598.6847 1615.2136 1617.5824 1623.9625 1674.7039 2981.6557 2995.7899 2997.2413 3023.3411 3042.0827 3078.5530 3086.8584 3094.4757 3107.3545 3117.2000 3123.4342 3130.5307 3142.1612 3153.3109 3167.3689 3258.3483 3335.6445 3346.5879 3385.8334 3474.9393 3500.1546 3508.3730
redmass: 6.1470 4.2679 5.0041 5.4350 5.5024 5.4320 6.1653 4.5211 1.9682 3.4497 5.0334 3.3060 6.3183 6.1994 3.5828 3.5399 2.5420 1.4838 4.0841 4.5517 5.0625 5.0775 4.8059 5.8990 5.7504 3.8320 4.9497 4.9816 2.5133 4.1119 2.7916 3.3620 3.5788 4.3691 1.8286 3.1431 2.5221 4.3214 5.8512 1.2126 4.1839 4.1527 4.3236 1.9417 6.0185 3.6728 1.4524 1.1736 2.1204 1.6835 6.0090 3.5425 3.4601 1.4131 1.2732 3.1807 2.8923 3.0132 2.3337 1.5060 3.0363 2.8651 2.0908 1.4238 2.2680 5.5511 1.3317 3.2901 2.2159 2.6188 2.9883 2.5987 1.5202 2.2466 3.1475 2.3471 1.0542 1.1235 1.3926 1.5633 1.7892 2.7096 1.1825 1.9346 1.5584 1.4436 1.1944 1.2509 1.3052 1.4649 1.2613 1.4264 1.2785 1.2944 8.1616 1.2455 1.1704 1.5555 2.1792 1.0995 1.2773 1.0823 1.4556 1.1543 2.2796 1.5415 1.7840 6.3927 7.0243 6.1157 6.9406 6.8873 1.0662 1.0851 1.0638 1.0370 1.0849 1.0588 1.0856 1.1017 1.0995 1.0998 1.1072 1.0870 1.0873 1.0920 1.0965 1.1017 1.0709 1.0833 1.0650 1.0438 1.0770 1.0983 1.0771
irintensity: 0.0531 0.2108 0.5442 2.4058 2.2840 9.8249 4.5565 8.7141 12.0172 8.4720 3.3975 3.3732 4.4230 2.5720 19.4986 11.6583 2.5308 3.0700 1.0636 0.6928 17.0166 13.3443 28.4049 27.0578 9.0740 0.6039 15.4400 26.7152 32.3650 4.4468 0.0143 10.7978 6.2416 8.3812 74.5062 63.6345 89.2726 10.0569 5.1535 97.9839 6.3471 14.0645 14.2119 43.0710 17.5026 12.9655 25.0503 231.2170 84.4770 105.1955 44.3012 13.9785 10.1754 123.8659 1.6614 42.8547 38.8650 19.1495 26.0809 3.3841 79.1693 18.9281 22.6558 0.1461 36.6972 0.6463 0.1693 36.0353 10.9600 84.3380 49.6247 22.6972 7.0441 4.2816 44.3517 41.5954 0.0186 7.1472 2.6245 101.8940 85.7044 23.1126 17.8037 32.5351 33.4210 24.5583 5.5559 147.3326 35.1638 11.8803 1.4281 25.5402 4.5881 6.0546 0.9408 64.2542 8.2023 128.3165 8.4545 10.0414 93.9604 5.9759 305.7818 135.4877 24.7956 222.2553 96.4520 27.8248 55.5715 8.1029 343.3497 299.4679 14.5601 32.3951 36.3132 13.5831 18.5501 27.9703 1.5395 46.7056 27.2263 23.3955 4.5401 4.6751 0.7179 15.1697 29.6376 19.5286 649.6314 156.8620 134.0570 6.9351 130.1693 1.4936 35.9906
temp: 298.150 k
press: 1.00000 atm
elementType: 8 8 8 8 8 8 7 7 7 7 6 6 6 6 6 6 6 6 6 6 6 6 6 6 6 1 1 1 1 1 1 1 1 1 1 1 1 1 1 1 1 1 1 1 1 1 1
symmnumber: 1
zpe: 983901.4 jmol-1
zpe.correction: 0.374748 hartree
zpe.thermalcorrener: 0.399878 hartree
zpe.thermalcorrenthalpy: 0.400823 hartree
zpe.thermalcorrgfe: 0.316426 hartree
zpe.sumelectzpe: -1253.251785 hartree
zpe.sumelectthermal: -1253.226655 hartree
zpe.sumelectthermalent: -1253.225710 hartree
zpe.sumelectthermalfe: -1253.310107 hartree
dipole: 5.0468 -0.7727 1.4191
dipole: 5.2992
quadrupole: -153.7159 -163.5340 -135.3371
quadrupole: 3.1558 -1.0613 4.1942
quadrupole: -2.8536 -12.6717 15.5252 3.1558 -1.0613 4.1942
hfenergy: -1253.626533 hartree
pointgroup: C01 [X(C15H22N4O6)]
dipole: -1.9965978 0.1404884 0.5835488 debye
polarizability: 251.2382589|5.7475044|185.7120687|1.0907819|26.0804402|195.3517659 unknown
InChI: InChI=1S/C15H22N4O6/c1-9(21)12(14(23)17-11(7-20)13(22)19-16)18-15(24)25-8-10-5-3-2-4-6-10/h2-6,9,11-12,17-21H,7-8,16H2,1H3
charge 0 multiplicity 1
47 atoms
O  0.831758 -3.793346 -2.10077
O  2.727214 -1.755977 -1.905281
O  -1.780269 0.02063 -1.581736
O  1.866387 2.366725 -0.102558
O  5.688757 0.479293 0.911496
O  -0.198883 0.530495 0.091207
N  2.631174 -0.417386 0.011343
N  -0.272296 -1.559328 -0.964489
N  3.983165 1.907018 1.626984
N  4.703377 2.416181 2.747034
C  0.900599 -2.139194 -0.285837
C  0.95506 -3.656861 -0.640928
C  2.184491 -1.430661 -0.795699
C  3.612544 0.597681 -0.427394
C  -0.175098 -4.47018 -0.00679
C  2.840035 1.799895 -1.047348
C  4.536185 0.981704 0.755582
C  -0.709216 -0.284753 -0.749334
C  -2.435708 1.365407 -1.369953
C  -3.539832 1.285731 -0.340723
C  -4.853458 0.916484 -0.727788
C  -3.275873 1.58081 1.021674
C  -5.887227 0.837623 0.230966
C  -4.309733 1.505025 1.980991
C  -5.616736 1.13307 1.587841
H  0.797584 -2.004098 0.80691
H  1.938749 -4.04246 -0.30142
H  4.25161 0.135368 -1.198036
H  2.046713 -0.170165 0.815892
H  -0.63332 -2.0999 -1.76048
H  -0.110179 -5.514349 -0.354807
H  -0.098334 -4.460589 1.095306
H  -1.164356 -4.073834 -0.293917
H  2.336939 1.463243 -1.974874
H  3.53888 2.615864 -1.29587
H  1.601405 -3.277319 -2.488257
H  -1.65131 2.084462 -1.079637
H  -2.819653 1.597956 -2.375186
H  3.093834 2.372063 1.374262
H  1.050136 1.779899 -0.050948
H  -5.063741 0.688646 -1.779991
H  -2.259311 1.857848 1.32264
H  4.771777 1.697308 3.482196
H  5.648724 2.705705 2.453794
H  -6.89919 0.552597 -0.077043
H  -4.098685 1.737866 3.030492
H  -6.419191 1.076704 2.331885
