program: Gaussian 09
title: 000267643
version: EM64L-G09RevD.01
frameworkgroup: C1[X(C21H27N5O5)]
method: RPBEPBE
basis: SDD
operation: Freq
keyword: #p
keyword: freq=noraman
keyword: PBEPBE/SDD
title: #p freq=noraman PBEPBE/SDD
converged: NO YES NO NO
title: Mulliken charges:
elementType: O O O O O N N N N N C C C C C C C C C C C C C C C C C C C C C H H H H H H H H H H H H H H H H H H H H H H H H H H H
charge: -0.269507 -0.215125 -0.264474 -0.454857 -0.454985 -0.169876 -0.083173 -0.201714 -0.056808 -0.603699 0.282927 -0.098880 -0.098911 -0.098817 -0.535150 -0.531759 -0.526758 -0.447555 -0.448017 -0.450719 0.136728 -0.350536 -0.014465 -0.185554 -0.198237 -0.051956 0.250268 -0.198691 -0.110831 0.172712 -0.313750 0.199678 0.198907 0.200831 0.221143 0.221129 0.200938 0.229778 0.205066 0.235031 0.196550 0.194609 0.196163 0.196068 0.196767 0.198580 0.255619 0.252273 0.259799 0.247754 0.266222 0.241174 0.405246 0.350536 0.276348 0.256832 0.350049 0.339079
chargesum: 0.00000
title: Mulliken charges with hydrogens summed into heavy atoms:
elementType: O O O O O N N N N N C C C C C C C C C C C C C C C C C C C C C
charge: -0.269507 -0.215125 -0.264474 -0.049612 -0.104449 -0.169876 -0.083173 -0.201714 -0.056808 0.085428 0.282927 0.100797 0.099996 0.102014 -0.092878 -0.101043 -0.086661 -0.056397 -0.055786 -0.055372 0.136728 0.157355 0.245334 0.062200 0.067986 0.189218 0.250268 0.077657 -0.110831 0.172712 -0.056918
polarizability: 3.53504575e+02 -1.96469216e+01 2.48136057e+02 -2.30585134e+01 -1.52761094e+01 2.00939739e+02
1716.lowfreq: -35.4230 -6.8625 -4.0576 -0.0014 -0.0010 -0.0006 6.7377 11.3600 13.2187
frequency: -28.3920 10.3512 12.2950 31.8567 43.6415 45.3045 76.9153 105.6050 117.7520 122.7714 153.9398 158.3276 203.6281 207.0059 227.1291 243.1133 250.8914 275.3840 279.3393 292.7837 294.5142 309.5011 322.0006 328.4165 334.7792 357.5387 380.4509 390.9972 397.6496 416.1684 417.8491 433.2592 435.2848 458.0732 503.2611 522.2626 534.0412 541.6134 556.1628 561.4750 565.0891 599.7927 635.2906 640.8399 647.1284 659.6665 670.7911 681.2290 694.7958 709.5405 720.4972 739.9128 764.3088 793.0734 805.4043 807.7840 809.2613 820.8052 830.4919 849.4861 867.1333 871.9222 873.2114 877.2685 890.6161 921.4270 931.4613 935.2019 936.9085 937.9620 948.9116 963.0421 966.6969 974.3497 979.6502 980.5736 994.4268 997.9459 1027.1640 1033.4366 1038.4327 1040.1323 1049.4212 1052.5010 1093.3931 1100.0668 1101.5770 1104.7095 1108.3648 1113.0783 1127.9445 1152.9041 1169.8213 1177.4598 1179.0258 1184.9640 1193.3068 1197.4606 1231.5168 1236.4362 1249.9598 1252.4887 1259.1156 1263.4032 1270.3856 1282.3263 1287.5836 1289.7215 1290.7207 1302.6506 1305.1288 1310.0193 1312.7967 1314.3010 1323.9184 1330.6000 1331.1212 1338.7403 1340.1595 1342.1376 1351.3071 1355.3597 1359.8350 1372.5592 1375.6896 1392.9311 1402.1292 1439.0847 1440.5068 1451.0028 1452.2507 1461.8025 1462.9210 1465.0260 1473.4520 1482.9601 1515.4889 1558.3697 1583.4775 1622.6519 1638.2161 2727.6004 2962.6930 2962.8908 2964.7321 2969.9886 2977.5281 2984.7558 2993.3321 2994.9500 2997.5465 3008.0723 3017.3239 3019.4412 3019.6014 3021.1868 3028.8500 3040.4558 3040.9070 3047.0087 3047.8868 3051.6437 3134.2492 3175.0202 3234.8228 3535.9164 3578.4070 3689.8575
redmass: 4.1633 5.4529 5.4816 6.4258 8.0621 6.8903 6.3584 4.9001 5.8000 5.0602 5.5265 6.6656 5.8604 6.1591 4.2892 5.0467 6.0653 3.5566 5.6592 2.2241 2.5552 3.7991 2.9212 1.8048 1.9466 3.2206 4.1710 4.7590 4.2206 2.2367 1.7506 3.9837 2.7245 2.3170 5.3804 9.1454 4.5517 1.2936 1.1444 3.5079 3.1748 6.2752 3.7997 3.8436 4.3800 4.3215 8.1244 6.3439 7.6278 5.3295 5.8332 5.3033 3.9753 5.0616 3.3132 4.2159 2.8151 4.3818 1.6785 4.1212 1.5899 1.5824 7.9949 1.5638 1.8297 1.8173 2.2826 3.3382 1.7516 1.9157 2.7662 2.4700 2.2998 2.2301 2.4790 2.5876 3.3430 5.4577 3.9776 6.6338 1.9057 3.9937 1.7280 1.8199 2.9511 1.5917 1.3509 1.3360 1.0375 1.0244 2.5066 2.0919 2.7216 1.8207 1.2107 2.0683 1.4492 1.4514 1.9315 1.3528 1.4813 1.3527 2.4571 1.7516 1.1810 1.7671 1.2828 1.8546 1.8448 4.8942 1.9983 1.3306 1.5067 1.6538 1.3156 2.1238 1.8889 1.6253 1.4653 1.4599 1.4267 1.5566 1.5771 1.5896 1.6667 2.5564 2.6465 1.0962 3.0485 1.0830 1.0827 1.0904 1.0895 1.0917 3.5352 1.0899 1.2052 5.7513 1.8222 10.9129 2.9282 1.0798 1.0643 1.0611 1.0612 1.0623 1.0639 1.0661 1.0820 1.0843 1.0802 1.0817 1.0870 1.1028 1.0854 1.1030 1.1023 1.1009 1.0874 1.0579 1.1017 1.1007 1.1078 1.0929 1.0990 1.0445 1.0662 1.1056
irintensity: 0.2748 0.4292 0.2142 0.1181 1.3222 0.8950 2.4210 0.6199 3.2159 0.6925 6.8584 0.7162 0.4672 1.6070 4.5964 3.2065 8.8731 10.2868 17.7612 0.5840 0.6405 6.7505 12.5414 67.8577 93.6379 28.3802 5.4793 0.1670 1.5742 1.8528 0.0339 6.5458 1.0300 1.3180 4.0920 9.7629 10.2952 224.2104 5.0414 5.8969 19.7056 6.2957 0.0162 0.5158 49.2675 8.3820 3.2557 11.3404 5.0419 2.2154 34.0422 18.8464 1.4703 12.1635 38.6240 66.2246 0.8120 1.8546 14.5638 8.7320 0.1788 1.0642 1.9344 0.3559 87.6518 69.4662 14.8412 58.5116 25.2663 8.5793 27.8017 2.7312 5.4672 13.7281 5.7905 57.0904 19.3422 196.1373 104.5573 127.3648 0.3082 51.2351 0.1445 2.4287 37.7772 6.4961 2.6713 3.1912 0.5434 0.0448 5.9959 54.5652 216.8814 15.0337 0.5899 22.1238 48.5635 59.1857 23.9307 27.9770 0.1135 14.5511 48.5628 1.6819 9.4791 0.0970 3.4684 0.1673 0.5297 23.6508 2.4141 4.5173 0.6183 0.1055 0.0008 10.0352 25.7253 68.0093 2.8675 3.6292 2.3415 0.2677 0.5150 58.8014 15.4110 34.1589 3.9754 16.7148 63.1678 0.4894 1.0918 17.2208 15.7004 27.6812 17.5836 2.7037 28.2094 72.3175 36.0874 149.0758 735.1141 1970.5230 20.7949 28.4301 22.2300 26.0312 17.6073 41.1731 155.3300 31.4650 131.7624 47.9020 38.2699 13.5396 22.9850 11.1454 103.4999 9.4107 22.4919 18.1273 39.9659 41.3561 1.5271 6.9764 0.3655 154.3103 10.9509 54.1971
temp: 298.150 k
press: 1.00000 atm
elementType: 8 8 8 8 8 7 7 7 7 7 6 6 6 6 6 6 6 6 6 6 6 6 6 6 6 6 6 6 6 6 6 1 1 1 1 1 1 1 1 1 1 1 1 1 1 1 1 1 1 1 1 1 1 1 1 1 1 1
symmnumber: 1
zpe: 1239578.3 jmol-1
zpe.correction: 0.472130 hartree
zpe.thermalcorrener: 0.497252 hartree
zpe.thermalcorrenthalpy: 0.498196 hartree
zpe.thermalcorrgfe: 0.415620 hartree
zpe.sumelectzpe: -1464.019252 hartree
zpe.sumelectthermal: -1463.994131 hartree
zpe.sumelectthermalent: -1463.993186 hartree
zpe.sumelectthermalfe: -1464.075763 hartree
dipole: 1.9340 1.0496 2.2591
dipole: 3.1536
quadrupole: -140.7705 -181.8429 -186.4906
quadrupole: -0.0422 -8.0063 9.9030
quadrupole: 28.9309 -12.1416 -16.7893 -0.0422 -8.0063 9.9030
hfenergy: -1464.4913827 hartree
pointgroup: C01 [X(C21H27N5O5)]
dipole: 0.9226476 -0.8272557 0.0614572 debye
polarizability: 331.2036547|46.2203319|207.5055355|-35.3357442|-5.6392516|263.8711808 unknown
InChI: InChI=1S/C21H27N5O5/c22-17-14-18(24-8-23-17)26(9-25-14)19-16(28)15(27)13(31-19)7-30-20(29)21-4-10-1-11(5-21)3-12(2-10)6-21/h8-13,15-16,19,27-28H,1-7,22H2
charge 0 multiplicity 1
58 atoms
O  -1.655895 0.35241 -0.347101
O  -2.10112 1.815263 1.411456
O  1.89456 1.080361 0.521528
O  1.423244 -1.123647 -1.596601
O  2.377214 -1.849515 1.955265
N  4.216026 0.65423 0.220211
N  6.262417 1.662554 -0.0711
N  3.685237 0.174375 -2.17133
N  5.451339 0.928506 -3.689039
N  7.419312 1.988673 -2.927853
C  -3.778762 0.090261 0.788259
C  -5.97697 -0.100682 2.051143
C  -4.807108 -2.198592 1.239505
C  -5.899377 -0.629722 -0.42698
C  -4.649714 0.692228 1.926265
C  -3.476101 -1.412706 1.109314
C  -4.569496 0.160107 -0.561095
C  -5.666219 -1.586639 2.379121
C  -6.759328 -0.018211 0.71199
C  -5.588458 -2.115823 -0.100232
C  -2.463553 0.860087 0.686017
C  -0.311042 0.970636 -0.503284
C  0.676721 0.221913 0.391553
C  1.224159 -1.121523 -0.168649
C  2.564054 -1.261528 0.619785
C  3.007361 0.205987 0.913796
C  4.458919 0.657785 -1.155829
C  5.329351 1.281173 0.815024
C  5.725997 1.277249 -1.314911
C  6.21713 1.406725 -2.647138
C  4.253624 0.347705 -3.404091
H  -6.584884 0.340653 2.8653
H  -4.577095 -3.257518 1.471587
H  -6.449844 -0.566813 -1.386462
H  -4.08978 0.662383 2.880196
H  -4.854226 1.75873 1.713501
H  -2.90253 -1.481362 2.055952
H  -2.850144 -1.84158 0.304673
H  -4.781578 1.218779 -0.811204
H  -3.949484 -0.2571 -1.375749
H  -6.609494 -2.157871 2.490567
H  -5.123345 -1.656464 3.343359
H  -7.720248 -0.564533 0.797017
H  -7.002804 1.038044 0.479189
H  -6.531921 -2.692668 -0.024686
H  -4.991389 -2.567425 -0.917839
H  -0.054708 0.836149 -1.56412
H  -0.351132 2.034084 -0.213722
H  0.246227 0.071201 1.401945
H  0.534775 -1.954675 0.057798
H  3.309557 -1.828263 0.030092
H  3.20116 0.290535 2.000183
H  2.264253 -0.579065 -1.860351
H  2.06068 -2.782496 1.858574
H  5.392049 1.42374 1.89193
H  3.679388 -0.021457 -4.25798
H  7.99556 2.353652 -2.171793
H  7.72004 2.060505 -3.898057
