program: Gaussian 09
title: 000267540
version: EM64L-G09RevD.01
frameworkgroup: C1[X(C11H9F3O4)]
method: RPBEPBE
basis: SDD
operation: Freq
keyword: #p
keyword: freq=noraman
keyword: PBEPBE/SDD
title: #p freq=noraman PBEPBE/SDD
converged: NO YES NO NO
title: Mulliken charges:
elementType: F F F O O O O C C C C C C C C C C C H H H H H H H H H
charge: -0.148299 -0.145388 -0.130038 -0.290679 -0.256630 -0.235404 -0.163389 -0.060319 -0.310849 -0.362990 0.237036 0.249157 -0.366341 -0.373054 -0.224084 -0.221201 0.219975 0.337306 0.276929 0.217265 0.251507 0.273550 0.257127 0.251265 0.252915 0.232308 0.232326
chargesum: 0.00000
title: Mulliken charges with hydrogens summed into heavy atoms:
elementType: F F F O O O O C C C C C C C C C C C
charge: -0.148299 -0.145388 -0.130038 -0.290679 -0.256630 -0.235404 -0.163389 0.216610 0.157923 0.167687 0.237036 0.249157 -0.115076 -0.120140 0.008224 0.011125 0.219975 0.337306
polarizability: 1.82671231e+02 2.52031423e+00 1.21066788e+02 1.02189123e+01 8.24189196e-01 8.54988669e+01
1716.lowfreq: -6.1878 -4.1682 -0.0008 -0.0005 -0.0005 4.1629 15.0219 25.0232 31.7336
frequency: 14.8598 24.8785 31.6269 38.1357 75.3337 133.4934 146.8327 167.4276 204.1270 242.9856 264.7561 291.8014 307.3129 362.2415 372.3438 402.1065 413.1482 449.0380 451.0920 484.4429 502.7503 527.2136 549.3956 580.0434 642.3783 644.0740 703.8210 710.4395 719.7638 755.9538 756.1838 814.2769 848.7838 854.8316 911.7910 917.1802 934.9865 969.8033 985.1443 1019.6406 1025.4411 1044.0879 1048.3982 1082.1935 1087.4456 1104.6352 1135.4854 1162.3000 1163.2978 1208.7105 1227.0459 1235.4219 1243.6083 1270.1627 1310.5951 1321.8334 1361.8422 1371.0977 1393.1424 1444.9274 1457.1170 1459.2294 1474.0070 1594.0777 1613.0372 1676.1288 2987.3770 3005.5378 3051.1655 3109.4487 3136.1980 3140.0883 3153.1816 3165.2899 3177.1404
redmass: 11.4542 6.7192 7.9851 13.7593 7.0716 7.4019 3.3809 9.2019 5.6656 5.1259 7.6633 4.9924 5.9268 5.8380 10.3150 5.9257 3.1321 3.4266 10.1088 5.5539 8.5277 9.1454 4.2369 6.7030 4.2381 9.3692 12.2565 4.2642 5.9272 1.7794 2.4260 6.0306 1.4765 2.6366 4.7669 2.6629 1.3677 1.2980 6.9904 12.6515 2.0530 9.0627 2.6380 7.3914 3.0257 2.4920 2.0507 1.2344 1.8468 1.2013 3.1317 3.7424 1.5139 1.4334 1.1747 1.3193 1.3126 1.7976 4.3195 2.2610 1.1098 1.1754 2.6004 7.5772 7.1205 11.6312 1.0704 1.0811 1.0581 1.0991 1.1091 1.0854 1.0899 1.0949 1.1007
irintensity: 0.0978 0.1328 0.4051 0.7448 2.5786 0.8553 4.9564 0.7386 5.8532 5.2344 2.4431 1.0464 7.0581 7.1868 1.9178 16.0287 7.2283 7.9768 7.2595 3.4850 1.1425 0.5036 0.8268 5.5937 7.0495 16.2431 20.0119 0.3189 14.2103 97.4780 37.6055 20.7724 0.4730 4.4171 3.2999 17.5278 5.2825 0.0131 75.7647 238.4368 27.9221 217.3659 27.1188 338.9865 155.4842 2.0138 8.9747 6.0744 8.9884 9.9301 106.8782 94.2341 119.5889 4.3377 5.1299 4.3567 14.9111 7.5378 14.9373 4.4200 23.6486 9.5776 175.4641 24.6601 3.4774 201.2038 34.8501 29.3576 10.9919 12.2278 3.4879 1.3070 11.3633 11.6240 12.4623
temp: 298.150 k
press: 1.00000 atm
elementType: 9 9 9 8 8 8 8 6 6 6 6 6 6 6 6 6 6 6 1 1 1 1 1 1 1 1 1
symmnumber: 1
zpe: 488477.9 jmol-1
zpe.correction: 0.186051 hartree
zpe.thermalcorrener: 0.201970 hartree
zpe.thermalcorrenthalpy: 0.202914 hartree
zpe.thermalcorrgfe: 0.139197 hartree
zpe.sumelectzpe: -1023.628320 hartree
zpe.sumelectthermal: -1023.612402 hartree
zpe.sumelectthermalent: -1023.611457 hartree
zpe.sumelectthermalfe: -1023.675174 hartree
dipole: -2.2477 -0.6452 1.7595
dipole: 2.9265
quadrupole: -107.0428 -102.5744 -104.7817
quadrupole: 0.0373 4.4525 -3.1370
quadrupole: -2.2431 2.2252 0.0180 0.0373 4.4525 -3.1370
hfenergy: -1023.8143712 hartree
pointgroup: C01 [X(C11H9F3O4)]
dipole: -0.8657309 -0.3466003 -0.6753077 debye
polarizability: 177.9789284|-20.4436236|99.4441302|3.5880055|-17.7386577|111.8138276 unknown
InChI: InChI=1S/C11H9F3O4/c12-11(13,14)10(15)17-6-7-5-16-8-3-1-2-4-9(8)18-7/h1-4,7H,5-6H2
charge 0 multiplicity 1
27 atoms
F  3.517103 -1.411991 2.138943
F  4.836024 -1.764021 0.31906
F  5.028397 0.157229 1.507825
O  -1.174045 0.226739 -1.282003
O  -1.908676 -0.891483 1.316793
O  2.148924 -1.073462 -0.272668
O  3.037198 1.09748 -0.17138
C  -0.169303 -0.223686 -0.293155
C  -0.747125 -1.373291 0.546506
C  1.029769 -0.63138 -1.157495
C  -2.480025 0.371375 -0.741302
C  -2.831772 -0.161829 0.527806
C  -3.431826 1.075028 -1.504572
C  -4.129615 0.037395 1.039188
C  -4.735226 1.262004 -0.995906
C  -5.080614 0.75204 0.27984
C  3.046187 -0.106407 0.125258
C  4.114147 -0.782164 1.027401
H  0.091997 0.627501 0.367031
H  -1.059165 -2.206978 -0.114373
H  -0.022878 -1.735932 1.29185
H  1.356732 0.216648 -1.782057
H  0.80216 -1.511265 -1.777691
H  -3.133626 1.472701 -2.479675
H  -4.373337 -0.378526 2.021699
H  -5.473785 1.809653 -1.589903
H  -6.088019 0.904523 0.680081
