program: Gaussian 09
title: 000267534
version: EM64L-G09RevD.01
frameworkgroup: C1[X(C10H10O4)]
method: RPBEPBE
basis: SDD
operation: Freq
keyword: #pfreq=noraman
keyword: PBEPBE/SDD
title: #p freq=noraman PBEPBE/SDD
converged: YES YES NO NO
title: Mulliken charges:
elementType: O O O O C C C C C C C C C C H H H H H H H H H H
charge: -0.293475 -0.258714 -0.406489 -0.233196 -0.019297 -0.346071 -0.541949 0.233339 0.246201 -0.369720 -0.374147 0.185207 -0.226674 -0.223729 0.257717 0.269440 0.209307 0.287026 0.266877 0.248148 0.250085 0.228879 0.229022 0.382213
chargesum: 0.00000
title: Mulliken charges with hydrogens summed into heavy atoms:
elementType: O O O O C C C C C C C C C C
charge: -0.293475 -0.258714 -0.024276 -0.233196 0.238419 0.132676 0.011954 0.233339 0.246201 -0.121571 -0.124062 0.185207 0.002205 0.005292
polarizability: 1.71378285e+02 -3.15425380e+00 1.15192600e+02 -4.96774725e+00 -2.43001567e+00 6.34718070e+01
1716.lowfreq: -10.4305 -7.2888 -2.7356 0.0005 0.0010 0.0012 33.2195 40.5197 81.0555
frequency: 33.2160 40.5109 81.0351 125.3391 150.0551 222.8676 236.1661 286.2809 291.5769 378.0564 445.7564 450.1611 475.1805 499.9241 514.5946 543.3912 560.4242 599.5713 643.5275 664.7176 711.4155 719.1154 754.5526 808.2754 844.7731 848.9110 886.8595 898.8885 932.4445 966.7370 979.2481 1020.2405 1029.0492 1060.3318 1068.0145 1093.5941 1146.0146 1161.4530 1166.2361 1182.2483 1226.4600 1238.5608 1249.8172 1269.6639 1309.3408 1319.9655 1362.8112 1376.9923 1392.9043 1436.0282 1443.5048 1461.1053 1475.1545 1591.9913 1612.6702 1662.2771 2983.8677 3007.6761 3015.5837 3068.1035 3120.1613 3137.6188 3150.9221 3163.3234 3175.4612 3515.3753
redmass: 9.7293 5.9720 4.7857 4.1573 3.2247 6.4447 3.5566 6.3342 5.2119 3.4654 3.3506 3.2839 5.1855 3.3161 2.6143 4.8392 4.8098 5.3889 1.3972 3.6726 4.3390 5.9769 1.2370 5.7861 2.1830 1.5726 4.1404 2.6706 1.3670 1.2921 7.2766 2.3471 2.0497 2.9689 2.3204 2.2261 1.9458 1.0803 2.5140 1.2181 1.5234 1.8669 1.6139 1.4506 1.3849 1.3191 1.6030 2.3650 4.0637 1.0864 2.2935 1.2322 2.4404 7.5427 7.0921 8.2317 1.0690 1.0741 1.0709 1.0981 1.0978 1.0852 1.0898 1.0947 1.1007 1.0640
irintensity: 0.6701 0.2290 1.7169 6.3675 2.8345 1.9561 4.7715 0.6449 1.1478 3.2364 11.3972 4.6069 4.5268 24.8833 35.9590 4.5046 2.2888 27.1283 120.1931 20.2143 0.3907 17.4752 110.0004 14.5831 16.4184 5.3069 16.0652 23.4214 5.6752 0.0084 53.6774 60.7269 183.3610 67.5898 64.4954 17.6107 21.7905 4.6732 17.7393 1.6201 51.9725 161.8438 36.5995 2.0737 6.8548 15.8633 66.8866 45.9537 37.3164 37.8387 5.4601 18.2518 161.2957 24.5807 3.5566 196.9477 37.1413 17.5718 21.3783 4.8672 4.7564 1.2568 12.3678 14.6498 14.4695 31.9528
temp: 298.150 k
press: 1.00000 atm
elementType: 8 8 8 8 6 6 6 6 6 6 6 6 6 6 1 1 1 1 1 1 1 1 1 1
symmnumber: 1
zpe: 480229.5 jmol-1
zpe.correction: 0.182910 hartree
zpe.thermalcorrener: 0.194932 hartree
zpe.thermalcorrenthalpy: 0.195876 hartree
zpe.thermalcorrgfe: 0.143435 hartree
zpe.sumelectzpe: -686.923032 hartree
zpe.sumelectthermal: -686.911010 hartree
zpe.sumelectthermalent: -686.910066 hartree
zpe.sumelectthermalfe: -686.962507 hartree
dipole: -1.7807 -1.1729 0.7788
dipole: 2.2701
quadrupole: -64.7333 -84.6437 -82.9945
quadrupole: 1.0714 -2.0725 3.2359
quadrupole: 12.7238 -7.1865 -5.5373 1.0714 -2.0725 3.2359
hfenergy: -687.1059415 hartree
pointgroup: C01 [X(C10H10O4)]
dipole: -0.7446702 -0.1452841 0.4711675 debye
dipolederiv: -1.6397411 0.1214867 -0.0299391 0.1145548 -0.3534603 0.0055479 0.084024 0.0132246 -0.2606135 -1.1656452 0.4183804 -0.0651773 0.4621249 -0.6255484 0.0611794 -0.1832735 0.141446 -0.2976641 -1.3002224 -0.1933414 0.3768728 -0.1600962 -0.3944322 -0.0186914 0.3460601 -0.0159318 -0.4393986 -0.7615001 0.0649501 -0.0532868 -0.1092981 -0.484406 0.2920483 0.1588589 0.2794261 -0.7414679 0.7282731 -0.0790533 0.1231307 -0.381266 0.2758879 0.0233369 0.3005316 -0.0107456 0.3079102 0.6623611 -0.205526 -0.0605912 0.1119886 0.1105031 0.0970367 -0.2326727 0.1305442 0.3018546 -0.2230098 0.0687541 -0.0783467 0.0916247 0.0003808 0.1441636 -0.2351517 0.1455543 -0.0715087 1.2396013 -0.0506149 -0.0293488 0.3963624 -0.0571242 0.036427 -0.3774136 0.1097328 -0.0042487 0.4672788 -0.3795861 0.1280611 -0.8201466 0.5169985 -0.1050987 0.4765535 -0.1988549 0.0603767 -0.1549094 -0.021012 -0.0098897 0.0484001 0.0025903 -0.0985624 -0.0690905 -0.0955741 -0.1058594 -0.0951551 0.1232958 -0.0583213 0.0320577 -0.0356508 -0.0877492 0.0008818 -0.1156326 -0.099964 1.7652385 0.0141854 -0.1742841 0.074271 0.5099273 -0.4873598 -0.2489631 -0.4704671 0.9367624 -0.0364977 -0.0049323 -0.0082977 -0.0651102 -0.0232204 -0.086093 0.0193899 -0.0941947 -0.1307715 0.0168268 -0.0152308 -0.0218306 0.0552718 -0.0580007 -0.0742042 -0.058074 -0.0695831 -0.1335675 0.0011394 0.0133085 0.0106922 0.0306555 0.0054622 -0.0436672 -0.0874266 -0.0391342 -0.1024261 0.0527823 0.0769027 -0.0175602 0.119646 0.0513674 0.0244994 -0.0350751 0.0550731 0.0612374 -0.0250094 0.0071671 -0.0040529 -0.0397443 0.0581007 -0.0325104 0.1094618 -0.1364505 -0.1260339 0.0667893 -0.0256202 -0.0132808 -0.0668618 -0.0096859 0.0138557 0.0293263 -0.0004245 0.1267847 0.0772125 0.0138194 -0.0222705 0.0184159 0.0826321 -0.0839224 0.0356959 -0.0556476 -0.0100344 0.0791951 -0.0581389 0.0429236 -0.0399665 0.0091432 0.0904738 0.0309917 0.0906466 0.1170996 0.0873365 -0.0221756 0.0192057 -0.0426879 0.00034 0.0969761 0.0309604 0.0923592 0.1168307 -0.0156289 0.1004708 -0.0366717 0.1075459 0.0080566 0.0778487 -0.036568 0.0833601 0.1253942 -0.124352 -0.0176091 0.0447113 -0.0210244 0.1054322 0.0366976 0.0477397 0.0422165 0.1383882 0.2976364 0.0501196 -0.062448 0.083283 0.3047067 0.1177678 -0.1067669 0.119057 0.2309196 unknown
polarizability: 169.0730799|-13.542077|102.1219376|-2.3177522|-23.8800712|78.8476744 unknown
InChI: InChI=1S/C10H10O4/c11-10(12)5-7-6-13-8-3-1-2-4-9(8)14-7/h1-4,7,11H,5-6H2
charge 0 multiplicity 1
24 atoms
O  -0.183895 -0.79919 0.648077
O  0.745289 1.60313 -0.730046
O  -4.836931 0.182407 0.359759
O  -3.532401 1.189831 -1.27456
C  -1.10244 0.07223 -0.129726
C  -0.586905 1.519198 -0.097258
C  -2.466683 -0.124719 0.538512
C  1.18933 -0.565689 0.387582
C  1.638974 0.599229 -0.292138
C  2.117188 -1.531417 0.826183
C  3.012924 0.774234 -0.554246
C  -3.611464 0.491966 -0.238829
C  3.494007 -1.347629 0.574009
C  3.940483 -0.199466 -0.12549
H  -1.120659 -0.279273 -1.180183
H  -1.236876 2.179625 -0.689501
H  -0.519355 1.875958 0.950669
H  -2.658248 -1.206931 0.65619
H  -2.461657 0.291686 1.563789
H  1.743176 -2.415989 1.351398
H  3.331495 1.677279 -1.084364
H  4.212142 -2.10018 0.915461
H  5.006654 -0.058519 -0.330728
H  -5.575646 0.599229 -0.16226
