program: Gaussian 09
title: 000267564
version: EM64L-G09RevD.01
frameworkgroup: C1[X(C19H16N2O7)]
method: RPBEPBE
basis: SDD
operation: Freq
keyword: #p
keyword: freq=noraman
keyword: PBEPBE/SDD
title: #p freq=noraman PBEPBE/SDD
converged: YES YES NO NO
title: Mulliken charges:
elementType: O O O O O O O N N C C C C C C C C C C C C C C C C C C C H H H H H H H H H H H H H H H H
charge: -0.258964 -0.199771 -0.196223 -0.229859 -0.376420 -0.185929 -0.273998 -0.264870 0.023221 -0.154302 -0.646246 0.095550 0.107794 0.182109 0.207636 0.597541 0.250900 -0.355119 -0.354987 -0.557644 -0.362803 0.276973 -0.210501 -0.208088 -0.309652 0.123264 -0.255798 -0.663414 0.287317 0.272668 0.262856 0.300009 0.270977 0.272192 0.244284 0.241094 0.241307 0.265393 0.239872 0.228084 0.222120 0.231702 0.249811 0.369913
chargesum: 0.00000
title: Mulliken charges with hydrogens summed into heavy atoms:
elementType: O O O O O O O N N C C C C C C C C C C C C C C C C C C C
charge: -0.258964 -0.199771 -0.196223 -0.229859 -0.006507 -0.185929 -0.273998 -0.264870 0.023221 0.133015 -0.110723 0.095550 0.107794 0.182109 0.207636 0.597541 0.250900 -0.084142 -0.082795 -0.257635 -0.118519 0.276973 0.030594 0.033219 -0.044258 0.123264 0.212158 0.040219
polarizability: 2.47017331e+02 -2.78014188e+01 2.66266252e+02 -1.59774453e+01 -2.30780306e+01 2.21943397e+02
1716.lowfreq: -4.0975 -0.0006 -0.0005 0.0001 3.4772 5.4674 13.5867 15.6417 21.6299
frequency: 13.3623 15.6312 21.5750 35.0909 40.1607 47.5371 68.0220 85.0574 96.4859 109.0467 127.2637 131.4605 139.4947 152.1488 180.8516 187.1838 208.8354 237.7454 251.5718 274.4878 285.5095 321.1633 338.9068 343.8688 361.6150 380.3220 403.5032 422.2608 427.4334 433.2207 455.1912 460.6133 497.4846 522.1143 525.3768 543.0831 553.0514 590.0200 626.0312 658.9162 666.4682 678.8460 690.4468 696.9823 712.0982 720.6839 731.8217 750.0784 773.9511 788.6698 797.5124 805.2728 817.2294 831.0352 850.3661 854.8101 872.8141 906.6517 907.3631 922.8160 938.3921 975.1792 976.9950 991.2496 1007.4218 1008.8155 1018.0236 1058.9487 1065.2880 1071.6780 1078.5128 1096.4337 1135.8788 1148.3557 1157.4265 1167.9092 1171.7725 1172.9324 1197.1985 1216.3501 1223.2089 1240.9754 1264.8394 1271.4917 1276.9348 1285.0527 1313.1324 1325.9178 1345.3719 1351.9268 1355.8065 1369.9903 1392.9878 1417.6497 1421.3173 1453.6740 1454.6283 1454.9364 1457.6848 1464.2354 1480.1904 1485.0293 1503.8936 1579.7020 1614.8381 1618.1895 1627.5573 1632.0602 1634.7942 1677.5541 2958.9274 2976.9028 2995.4284 3024.6844 3035.6482 3089.1470 3091.0163 3098.4675 3125.0186 3131.4173 3141.1957 3154.7660 3164.7424 3166.3242 3175.8792 3180.1711
redmass: 7.4676 7.9755 6.5185 4.8708 4.5012 5.2844 5.5412 7.4974 5.6357 4.8924 6.7705 8.0784 5.1862 5.6137 7.1866 7.3096 1.3792 4.9608 5.0585 3.2512 4.7571 4.9443 5.2019 5.5188 6.4196 5.0430 3.1265 9.6487 3.9530 3.6741 4.8383 4.3075 5.2710 6.5180 6.3392 5.0358 5.5611 5.9576 5.1701 4.8151 7.3057 6.9172 6.3198 5.4609 3.6263 5.7381 3.9356 4.1497 4.2236 5.0988 1.8574 2.4452 1.7989 1.5566 1.4817 2.4573 2.6398 4.4836 1.4160 2.7894 1.6502 1.4146 1.3539 2.7235 1.3519 2.6241 2.5383 3.2924 3.2485 2.7578 3.0782 2.1705 1.6130 3.9151 1.6628 1.4570 2.1024 2.0709 2.2160 1.8839 2.1004 1.8731 2.8505 1.4702 1.1230 1.4982 1.7761 2.0468 2.4709 2.0973 1.3290 2.6659 1.2295 6.0865 5.9311 2.3778 2.6985 2.5007 1.0984 1.0435 1.1199 1.0521 4.1342 4.1365 7.7109 8.0468 10.7930 10.4888 6.8549 12.2792 1.0658 1.0812 1.0362 1.0610 1.0599 1.1026 1.0973 1.1030 1.1068 1.0907 1.0866 1.0907 1.0923 1.0957 1.1004 1.0952
irintensity: 0.4336 1.0674 0.3293 0.7283 0.3854 1.1010 0.9315 0.9011 2.1859 3.5657 2.4254 1.1892 0.1246 0.5777 1.4261 1.3679 1.7294 2.3553 2.0453 2.0259 1.5095 17.9107 9.0498 12.3513 4.3341 4.9424 4.5246 1.7344 0.1715 2.7694 0.0134 2.9480 17.1835 6.1358 13.5128 6.5650 16.2519 30.2496 9.7306 0.0404 6.1443 1.7500 0.9533 3.8204 64.8865 4.0142 44.2260 3.7743 7.1871 0.4701 26.8626 9.2692 8.0473 73.1371 82.3343 8.5666 18.4309 0.5000 0.0717 38.6534 8.4141 1.5056 3.3377 19.2177 0.0118 27.6514 88.7782 41.7239 7.6636 33.5112 14.4040 23.8131 82.2995 232.8229 10.5482 77.0821 134.0294 42.9393 29.2302 60.0977 40.8129 62.7152 145.2547 18.0229 6.6967 0.4887 78.6230 96.2830 139.8615 182.1625 19.0558 60.0569 26.2600 9.4958 10.2700 43.4360 6.4423 12.8302 12.4519 15.2133 13.8500 13.7313 124.3811 37.7140 6.6374 87.8135 219.6544 255.2932 44.9477 62.4896 141.0384 13.5565 17.2335 4.4375 21.7341 0.8302 31.9259 1.5005 24.3992 7.6971 1.6977 5.1862 3.4097 4.4664 18.4025 2.6220
temp: 298.150 k
press: 1.00000 atm
elementType: 8 8 8 8 8 8 8 7 7 6 6 6 6 6 6 6 6 6 6 6 6 6 6 6 6 6 6 6 1 1 1 1 1 1 1 1 1 1 1 1 1 1 1 1
symmnumber: 1
zpe: 846409.9 jmol-1
zpe.correction: 0.322381 hartree
zpe.thermalcorrener: 0.347203 hartree
zpe.thermalcorrenthalpy: 0.348147 hartree
zpe.thermalcorrgfe: 0.263830 hartree
zpe.sumelectzpe: -1367.662126 hartree
zpe.sumelectthermal: -1367.637304 hartree
zpe.sumelectthermalent: -1367.636359 hartree
zpe.sumelectthermalfe: -1367.720677 hartree
dipole: 4.7879 1.9081 1.9267
dipole: 5.5024
quadrupole: -166.7644 -140.2432 -171.5637
quadrupole: 9.2951 -3.7740 0.0370
quadrupole: -7.2406 19.2806 -12.0399 9.2951 -3.7740 0.0370
hfenergy: -1367.9845069 hartree
pointgroup: C01 [X(C19H16N2O7)]
dipole: 1.8793184 0.7844425 0.7343601 debye
polarizability: 247.0520419|-28.3098747|263.6728957|-14.1670749|-25.8084491|224.5020422 unknown
InChI: InChI=1S/C19H16N2O7/c1-2-28-19(25)15(10-11-7-8-16(22)14(9-11)21(26)27)20-17(23)12-5-3-4-6-13(12)18(20)24/h3-9,15,22H,2,10H2,1H3
charge 0 multiplicity 1
44 atoms
O  3.635898 -0.925329 -0.145394
O  0.900528 0.366189 2.422004
O  1.42381 0.376204 -2.255825
O  2.925428 -3.089981 -0.651063
O  -5.104797 -1.094319 1.305411
O  -3.767162 0.779125 -2.224393
O  -5.421933 0.463332 -0.688257
N  1.150021 0.02771 0.08231
N  -4.203448 0.220235 -1.154996
C  1.277496 -1.428319 0.124309
C  0.186284 -2.160493 -0.714985
C  0.991288 0.826109 1.257536
C  1.255436 0.824688 -1.094357
C  0.962284 2.24199 0.778114
C  1.119146 2.241406 -0.630132
C  -1.215496 -1.864902 -0.21634
C  2.682623 -1.918104 -0.284987
C  0.811057 3.436168 1.498097
C  1.127276 3.43543 -1.365656
C  -2.059686 -0.980645 -0.90311
C  -1.705616 -2.473032 0.983141
C  -3.3637 -0.704183 -0.412954
C  0.819781 4.650307 0.762963
C  0.974926 4.649755 -0.646611
C  -2.989631 -2.211803 1.474885
C  -3.854782 -1.318706 0.788808
C  5.052414 -1.306914 -0.466624
C  5.728468 -1.938425 0.752155
H  1.156961 -1.694687 1.195968
H  0.301079 -1.861457 -1.770338
H  0.413179 -3.239656 -0.652727
H  -1.740049 -0.492903 -1.829273
H  0.689911 3.424388 2.585634
H  1.244502 3.423416 -2.4536
H  -1.060356 -3.170994 1.530384
H  0.702967 5.603319 1.289658
H  0.974649 5.602298 -1.186942
H  -3.363516 -2.681048 2.388723
H  5.036547 -1.997133 -1.32788
H  5.513457 -0.34865 -0.752286
H  6.793457 -2.13024 0.524901
H  5.678048 -1.265156 1.624935
H  5.254457 -2.899755 1.010812
H  -5.572405 -0.43203 0.67778
