program: Gaussian 09
title: 000267542
version: EM64L-G09RevD.01
frameworkgroup: C1[X(C15H13Cl2NS)]
method: RPBEPBE
basis: SDD
operation: Freq
keyword: #p
keyword: freq=noraman
keyword: PBEPBE/SDD
title: #p freq=noraman PBEPBE/SDD
converged: YES YES NO NO
title: Mulliken charges:
elementType: Cl Cl S N C C C C C C C C C C C C C C C H H H H H H H H H H H H H
charge: -0.072523 -0.056619 0.236846 -0.299111 -0.376367 0.533629 0.493083 -0.357875 -0.388624 -0.344894 -0.268699 -0.334970 -0.628234 -0.250388 -0.263508 -0.122752 -0.234742 -0.268215 -0.249431 0.243775 0.244703 0.303782 0.276851 0.243923 0.226267 0.238653 0.241491 0.254428 0.249955 0.232069 0.261834 0.235661
chargesum: 0.00000
title: Mulliken charges with hydrogens summed into heavy atoms:
elementType: Cl Cl S N C C C C C C C C C C C C C C C
charge: -0.072523 -0.056619 0.236846 -0.299111 0.112111 0.533629 0.493083 -0.054093 -0.388624 -0.344894 0.008152 -0.091048 0.078177 0.004040 -0.013553 -0.122752 -0.002673 -0.006381 -0.013770
polarizability: 2.88002831e+02 3.93076018e+00 1.96463460e+02 -3.03384031e+00 -3.73961413e+01 1.39483852e+02
1716.lowfreq: -9.3970 -4.3341 -0.0023 -0.0014 0.0003 6.0115 34.0128 41.6180 43.9673
frequency: 33.9842 41.5836 43.9531 63.4992 90.5650 122.1876 157.0602 176.6438 192.6415 227.3103 242.5849 261.0425 281.4910 303.3178 320.4470 332.2034 359.0059 376.2837 414.6916 428.3413 435.4440 441.2467 474.8292 516.9877 533.3733 571.9075 595.3382 600.8206 650.4745 673.7053 683.6583 710.6356 727.2911 755.7107 779.3213 803.0766 852.3138 857.5150 867.0715 886.3344 932.9440 934.8139 952.7486 975.9776 1012.2263 1023.0937 1026.7412 1041.7478 1082.4480 1090.4883 1118.8249 1127.2513 1140.1029 1145.8734 1176.1473 1211.0423 1237.0616 1244.7708 1261.7437 1279.6343 1313.9924 1337.4810 1361.3579 1370.9607 1379.4780 1393.3359 1404.0802 1428.8289 1453.7769 1465.4123 1471.2301 1474.8067 1490.5965 1559.2901 1579.8933 1580.7477 1607.7152 2987.7138 2988.4539 3075.5945 3086.4813 3098.9831 3112.9162 3135.0391 3143.9510 3151.3311 3156.7661 3171.6761 3172.1562 3183.2375
redmass: 11.2507 4.6165 5.8550 5.2243 6.7031 4.7059 5.7538 6.6885 5.9836 5.5668 1.1334 4.0923 8.6973 5.7826 3.9005 4.0659 7.9130 6.5475 4.4130 2.8707 3.6685 3.1628 4.9883 6.5453 4.3996 6.0823 5.0913 6.2347 4.8132 5.3831 5.9805 4.7323 3.6049 1.3416 5.8909 1.3350 1.3831 1.4512 2.3491 3.2686 1.3818 1.3433 1.5846 1.3182 1.9082 3.5748 6.2726 2.2629 2.9617 2.5620 1.8369 1.6478 1.6107 1.9467 1.0696 1.3198 1.4984 2.0337 1.4359 1.6961 2.0338 1.3348 1.6068 5.0004 8.8072 1.2967 2.6542 2.3112 2.6542 1.0496 1.0661 2.5444 1.1075 6.5639 6.7176 7.4939 7.3999 1.0443 1.0603 1.0919 1.0944 1.0952 1.0985 1.0852 1.0898 1.0898 1.0941 1.0921 1.1005 1.0963
irintensity: 0.4033 1.1650 0.2257 0.0511 1.4724 0.0831 1.2690 2.6861 0.2436 1.6464 1.0455 0.6091 2.8835 0.8181 3.8387 1.9742 4.4755 0.7745 1.8752 9.1313 0.4162 0.4606 17.5897 22.0009 5.1751 9.3251 23.1430 2.0516 7.5189 7.2064 2.3534 1.1443 9.0952 84.5363 17.3836 37.9603 2.5467 31.1216 28.7518 34.9482 1.8707 0.5054 27.4989 0.0663 42.2334 35.2375 7.9068 10.1927 13.6523 39.1135 14.7917 28.3217 12.5135 9.9925 0.4352 32.2920 28.7241 36.4625 13.4920 3.3986 88.6151 2.6662 1.4300 18.0396 5.9155 28.4386 29.5273 7.2581 324.8303 18.6384 8.6955 24.2036 9.7914 37.2669 4.4027 68.1570 37.6394 24.6310 11.6861 1.6107 10.2976 12.0259 24.0255 1.4593 5.7636 2.4979 18.7927 1.8055 20.6124 1.2467
temp: 298.150 k
press: 1.00000 atm
elementType: 17 17 16 7 6 6 6 6 6 6 6 6 6 6 6 6 6 6 6 1 1 1 1 1 1 1 1 1 1 1 1 1
symmnumber: 1
zpe: 628271.9 jmol-1
zpe.correction: 0.239296 hartree
zpe.thermalcorrener: 0.256579 hartree
zpe.thermalcorrenthalpy: 0.257523 hartree
zpe.thermalcorrgfe: 0.192864 hartree
zpe.sumelectzpe: -1950.984696 hartree
zpe.sumelectthermal: -1950.967413 hartree
zpe.sumelectthermalent: -1950.966469 hartree
zpe.sumelectthermalfe: -1951.031128 hartree
dipole: 2.6847 -0.9337 -0.0164
dipole: 2.8425
quadrupole: -131.0099 -136.2715 -131.5311
quadrupole: 4.1779 -6.3666 -5.5410
quadrupole: 1.9276 -3.3340 1.4064 4.1779 -6.3666 -5.5410
hfenergy: -1951.223992 hartree
pointgroup: C01 [X(C15H13Cl2N1S1)]
dipole: -0.9902547 0.5143571 0.0741363 debye
polarizability: 287.5458121|-5.7218023|198.7286048|-5.2675841|36.0158897|137.6757254 unknown
InChI: InChI=1S/C15H13Cl2NS/c1-10(16)9-18-12-4-2-3-5-14(12)19-15-7-6-11(17)8-13(15)18/h2-8,10H,9H2,1H3
charge 0 multiplicity 1
32 atoms
Cl 0.937159 -4.526081 0.253542
Cl 4.716478 0.28946 -1.475133
S  -0.720517 1.862423 1.603574
N  -0.29823 -0.6029 -0.1496
C  -0.109167 -2.050336 -0.38703
C  0.846554 0.247106 -0.085208
C  -1.603677 -0.024846 -0.289092
C  0.670278 -2.704543 0.778039
C  0.78632 1.476458 0.630453
C  -1.941241 1.157304 0.424393
C  2.062051 -0.096439 -0.737729
C  -2.579986 -0.585811 -1.155442
C  -0.054723 -2.666507 2.119663
C  1.891887 2.347384 0.670009
C  -3.208194 1.757065 0.287144
C  3.163652 0.772311 -0.646779
C  -3.863846 -0.008517 -1.263439
C  3.109566 1.997518 0.041187
C  -4.185637 1.163695 -0.544281
H  0.399578 -2.262678 -1.347969
H  -1.100969 -2.526674 -0.430037
H  1.695831 -2.312402 0.853963
H  2.149127 -1.019018 -1.316595
H  -2.336749 -1.463947 -1.761577
H  -1.037272 -3.165793 2.054529
H  0.540147 -3.162431 2.904117
H  -0.21753 -1.612578 2.414976
H  1.813856 3.294831 1.21261
H  -3.431678 2.675789 0.839593
H  -4.604241 -0.467547 -1.927193
H  3.980493 2.655291 0.092168
H  -5.177218 1.618314 -0.634061
