program: Gaussian 09
title: 000267519
version: EM64L-G09RevD.01
frameworkgroup: C1[X(C10H24Si)]
method: RPBEPBE
basis: SDD
operation: Freq
keyword: #p
keyword: freq=noraman
keyword: PBEPBE/SDD
title: #p freq=noraman PBEPBE/SDD
converged: YES YES NO NO
title: Mulliken charges:
elementType: Si C C C C C C C C C C H H H H H H H H H H H H H H H H H H H H H H H H
charge: 1.303802 -0.798924 -0.798925 -1.027050 -1.027048 -0.319337 -0.319338 -0.342014 -0.342013 -0.694819 -0.694819 0.215255 0.216556 0.215256 0.216556 0.232857 0.230544 0.232410 0.230544 0.232410 0.232856 0.192865 0.194012 0.192866 0.194012 0.191901 0.191653 0.191901 0.191653 0.208180 0.215564 0.208444 0.208179 0.215564 0.208444
chargesum: 0.00000
title: Mulliken charges with hydrogens summed into heavy atoms:
elementType: Si C C C C C C C C C C
charge: 1.303802 -0.367113 -0.367113 -0.331238 -0.331238 0.067541 0.067540 0.041541 0.041542 -0.062632 -0.062632
polarizability: 1.43866521e+02 -2.58032653e-05 1.39386204e+02 2.50041404e+00 -1.90519984e-05 1.19193056e+02
1716.lowfreq: -15.0526 -9.6384 -5.2357 -0.0018 -0.0013 -0.0009 21.4339 56.0396 58.8536
frequency: 21.2815 55.5110 58.7312 69.6886 84.1574 88.9970 97.9439 116.3905 116.8551 140.8170 175.2749 190.9635 199.3451 206.8809 216.8461 223.8772 233.7467 311.1802 319.6797 386.5146 399.1219 598.9729 661.9637 688.6262 691.3870 709.3276 709.7794 734.4200 751.0139 799.2745 799.7300 849.0708 875.5707 884.0019 888.8182 902.5701 907.5964 1014.3581 1015.1852 1019.0417 1024.1059 1064.2784 1064.9769 1086.3505 1087.1662 1191.2535 1195.2222 1199.5863 1202.1330 1265.9017 1266.0121 1286.7533 1291.0592 1291.7791 1294.6347 1296.5894 1300.2534 1341.6991 1344.0470 1386.5331 1386.6183 1437.5621 1438.8961 1448.3810 1448.7595 1454.1846 1460.5572 1464.4467 1466.9001 1474.4390 1474.6772 1474.8849 1475.8233 1486.0929 1486.6564 2952.2379 2952.6587 2957.6219 2958.2305 2968.0939 2968.8853 2970.5728 2970.6887 2976.8681 2977.6903 2990.7630 2991.3679 3010.6251 3010.6409 3030.6170 3032.6364 3066.9555 3067.4489 3069.5016 3069.5050 3076.9374 3078.7536 3080.7665 3080.7740
redmass: 3.4474 1.5680 1.5198 2.3442 2.7464 3.0517 1.1707 1.8404 1.3109 1.5382 2.6846 1.9382 2.1952 2.2393 1.3958 1.2743 2.0891 3.5927 3.5906 2.7806 2.8588 3.5189 1.4380 2.1855 2.1854 1.3925 2.2102 1.1093 1.2014 1.5252 1.2620 1.4793 1.2667 1.7841 1.7537 1.4897 1.5279 2.3713 3.5552 1.3876 1.1586 2.6176 2.6206 1.8516 1.8460 1.4660 1.5118 1.5401 1.4707 1.2055 1.2024 1.1776 1.1382 1.1131 1.2447 1.3107 1.1939 1.5176 1.5166 1.2153 1.2153 1.0729 1.0770 1.0562 1.0599 1.0518 1.0497 1.0678 1.0655 1.0595 1.0451 1.0532 1.0693 1.0777 1.0795 1.0586 1.0586 1.0586 1.0586 1.0583 1.0590 1.0365 1.0373 1.0343 1.0342 1.0974 1.0975 1.1007 1.1010 1.1031 1.1031 1.1007 1.1007 1.0992 1.0992 1.0982 1.0977 1.0979 1.0974
irintensity: 0.0010 0.0002 0.0027 0.0190 0.0019 0.0070 0.0079 0.0047 0.0284 0.0029 0.1210 0.0001 1.4590 0.6053 0.8924 0.0640 1.5478 3.1502 3.6781 0.0645 2.5417 3.1886 0.9780 0.0267 15.7069 25.1249 4.0215 9.6372 0.1202 32.0918 0.0537 21.6992 1.8053 8.2248 22.7195 92.2585 131.2135 0.0211 2.2858 22.9044 10.0876 5.7166 3.6810 26.0161 23.6919 11.8773 4.3224 3.7144 13.6264 2.1073 2.7318 36.3241 7.2491 8.0625 1.9326 2.7981 18.3039 0.0566 1.8223 16.5747 7.9357 7.9536 1.0282 0.1410 10.3673 6.1836 14.3762 1.2284 0.3493 10.2581 9.8619 7.2101 4.2112 27.9997 1.3587 0.4716 0.0043 0.1736 13.7222 6.2359 166.5722 44.3532 31.0864 25.2796 13.7700 0.0784 0.3840 2.0597 0.7721 67.0863 53.9986 90.1190 83.3284 86.7767 19.4045 1.3600 41.0778 22.1743 29.1733
temp: 298.150 k
press: 1.00000 atm
elementType: 14 6 6 6 6 6 6 6 6 6 6 1 1 1 1 1 1 1 1 1 1 1 1 1 1 1 1 1 1 1 1 1 1 1 1
symmnumber: 1
zpe: 824732.9 jmol-1
zpe.correction: 0.314124 hartree
zpe.thermalcorrener: 0.331865 hartree
zpe.thermalcorrenthalpy: 0.332809 hartree
zpe.thermalcorrgfe: 0.267350 hartree
zpe.sumelectzpe: -683.928705 hartree
zpe.sumelectthermal: -683.910964 hartree
zpe.sumelectthermalent: -683.910020 hartree
zpe.sumelectthermalfe: -683.975478 hartree
dipole: 0.0000 -0.0647 0.0000
dipole: 0.0647
quadrupole: -81.0711 -81.6996 -81.9320
quadrupole: 0.0000 -0.5884 0.0000
quadrupole: 0.4964 -0.1320 -0.3644 0.0000 -0.5884 0.0000
hfenergy: -684.2428288 hartree
pointgroup: C01 [X(C10H24Si1)]
dipole: 0.0000029 -0.0254373 -0.0000005 debye
polarizability: 143.7888997|-0.0001831|139.3862037|2.8567884|0.0006701|119.2706778 unknown
InChI: InChI=1S/C10H24Si/c1-5-7-9-11(3,4)10-8-6-2/h5-10H2,1-4H3
charge 0 multiplicity 1
35 atoms
Si 0.000051 1.60849 0.000071
C  -1.344097 0.502681 0.827201
C  1.344142 0.502667 -0.82713
C  0.807199 2.719201 1.340423
C  -0.807047 2.719318 -1.340215
C  -2.075606 -0.465562 -0.138491
C  2.075634 -0.465652 0.138501
C  -3.163883 -1.316713 0.559008
C  3.163837 -1.316834 -0.559073
C  -3.889426 -2.280126 -0.405502
C  3.889367 -2.280326 0.405368
H  -2.087549 1.166346 1.317632
H  -0.872585 -0.080153 1.646671
H  2.087611 1.166325 -1.317545
H  0.872589 -0.080109 -1.646617
H  1.28948 2.114127 2.130725
H  1.578717 3.378148 0.899789
H  0.050037 3.363732 1.824877
H  -1.578535 3.378274 -0.899542
H  -0.049854 3.363842 -1.824629
H  -1.289357 2.114314 -2.130554
H  -2.5458 0.108921 -0.963837
H  -1.340648 -1.147015 -0.616692
H  2.545889 0.108773 0.963852
H  1.340656 -1.147084 0.616702
H  -3.901249 -0.637714 1.034285
H  -2.697133 -1.893422 1.383651
H  3.901222 -0.637857 -1.034352
H  2.697024 -1.893486 -1.383721
H  -3.177766 -2.991648 -0.86589
H  -4.665206 -2.869778 0.117114
H  -4.382905 -1.723445 -1.224702
H  3.177684 -2.991822 0.865763
H  4.665086 -2.870007 -0.117305
H  4.382919 -1.723707 1.224566
