program: Gaussian 09
title: 000267514
version: EM64L-G09RevD.01
frameworkgroup: C1[X(C8H10N4)]
method: RPBEPBE
basis: SDD
operation: Freq
keyword: #pfreq=noraman
keyword: PBEPBE/SDD
title: #p freq=noraman PBEPBE/SDD
converged: YES YES NO NO
title: Mulliken charges:
elementType: N N N N C C C C C C C C H H H H H H H H H H
charge: -0.146825 -0.059450 -0.085352 -0.626092 0.098460 0.133809 -0.356713 -0.204490 -0.398035 0.135920 -0.660039 -0.372301 0.214802 0.257840 0.254915 0.243693 0.244210 0.218691 0.218604 0.237892 0.319859 0.330602
chargesum: 0.00000
title: Mulliken charges with hydrogens summed into heavy atoms:
elementType: N N N N C C C C C C C C
charge: -0.146825 -0.059450 -0.085352 0.024370 0.098460 0.133809 0.115929 0.050425 -0.154341 0.135920 0.021465 -0.134409
polarizability: 1.55962318e+02 -3.46578108e+00 1.24837166e+02 7.10244999e+00 1.56301958e+00 5.85037863e+01
1716.lowfreq: -13.9212 -8.8580 -0.0009 -0.0008 -0.0007 4.6172 22.8641 78.8779 155.9661
frequency: 21.1117 78.8533 155.9638 184.3194 208.1839 251.5814 274.9338 312.6966 379.9183 394.7556 508.4636 521.2886 529.6608 546.3195 563.7997 617.3718 666.9537 676.3963 707.6340 717.7397 790.9873 799.0284 844.0827 859.0780 921.4194 939.1928 959.8473 1026.3058 1041.6429 1087.0506 1108.9945 1179.9286 1195.6538 1248.1521 1268.1922 1323.7732 1331.3328 1341.7453 1361.0548 1389.0928 1394.6257 1433.1023 1441.4019 1466.7539 1469.2639 1484.0715 1493.8416 1541.2161 1579.1169 1621.3358 2989.8431 3010.4008 3071.8992 3089.7659 3103.4630 3159.9518 3204.8747 3232.5183 3550.8911 3709.2465
redmass: 2.4998 3.8418 4.0527 1.4809 4.8826 1.6816 5.3336 2.6926 2.9670 1.2591 6.1457 1.6303 1.9608 3.8276 3.7311 3.5611 7.3332 4.9909 5.1531 1.3345 1.2477 7.1209 1.3639 6.7515 1.4222 2.8394 2.0846 2.1771 2.0736 2.0432 1.4193 2.8344 1.8707 2.8066 1.6510 4.4280 2.6620 2.3731 1.6432 1.2332 2.0948 3.0496 3.4686 1.1729 1.1254 1.0787 3.6070 5.2293 3.0924 1.7615 1.0355 1.0621 1.1012 1.0992 1.1024 1.0919 1.0908 1.1058 1.0450 1.1043
irintensity: 0.3363 5.0604 0.5843 3.8930 0.8997 4.4433 2.8535 0.9439 7.4502 198.2638 2.6538 46.5688 26.0587 5.4199 0.3633 21.1373 0.8333 11.3497 0.3430 105.0001 7.7545 0.2046 0.3049 8.2659 12.2990 28.9045 0.4024 2.5348 4.2076 7.9734 11.7846 2.7297 12.0959 52.7407 3.5966 12.1775 117.2481 28.8149 11.3457 14.9430 23.2815 37.3084 20.4562 5.5744 15.0509 6.7199 98.8109 46.9392 94.0134 471.2327 25.0940 42.0230 3.6410 39.0787 27.3493 21.9407 1.7025 3.2609 93.0966 31.8800
temp: 298.150 k
press: 1.00000 atm
elementType: 7 7 7 7 6 6 6 6 6 6 6 6 1 1 1 1 1 1 1 1 1 1
symmnumber: 1
zpe: 462847.6 jmol-1
zpe.correction: 0.176289 hartree
zpe.thermalcorrener: 0.186868 hartree
zpe.thermalcorrenthalpy: 0.187813 hartree
zpe.thermalcorrgfe: 0.139316 hartree
zpe.sumelectzpe: -529.002754 hartree
zpe.sumelectthermal: -528.992175 hartree
zpe.sumelectthermalent: -528.991231 hartree
zpe.sumelectthermalfe: -529.039727 hartree
dipole: -1.2056 3.7346 0.1847
dipole: 3.9287
quadrupole: -56.0735 -67.2288 -74.1814
quadrupole: 6.4265 2.2426 0.3114
quadrupole: 9.7544 -1.4009 -8.3535 6.4265 2.2426 0.3114
hfenergy: -529.1790432 hartree
pointgroup: C01 [X(C8H10N4)]
dipole: 0.5263809 -1.4469516 0.135524 debye
dipolederiv: -0.76742 0.0377703 -0.0266444 -0.3594292 -0.415683 0.0130849 0.0863165 0.0038392 -0.1970833 -0.7951061 0.0615589 0.0376705 0.1003295 -0.5655171 0.0431266 0.0442313 0.026115 -0.2034511 -0.693866 -0.005109 0.0345977 -0.5514907 -0.8037284 0.0993019 0.0939401 0.047055 -0.2583322 -1.1610917 -0.5238934 0.0784417 -0.7798245 -0.536642 0.0617335 0.1149643 0.0423497 -0.7262866 0.8204684 -0.2641659 -0.0116444 -0.0678335 0.2653569 -0.0405263 -0.06141 0.0103325 0.0687681 -0.7620734 -0.2334566 0.0802549 -0.2349575 -0.0139019 0.0062729 0.1005029 0.0301108 0.0076268 0.7241287 0.1446251 0.0070502 0.2994483 0.1965642 0.0532507 -0.0732995 0.0433346 0.2714993 0.0447439 0.1607743 -0.0285465 0.5110784 0.2642952 -0.0462417 -0.0746504 -0.0520782 -0.1535098 -0.2491139 -0.0481482 -0.0295366 -0.0456046 -0.0728542 -0.0136635 0.0011727 -0.0123518 -0.2674025 1.493388 0.5351528 -0.1653742 0.8232039 0.840881 -0.1342237 -0.2054263 -0.1085139 0.2315195 -0.0761688 -0.0287952 -0.035996 -0.0489674 0.0668454 -0.0253112 -0.040394 -0.0368397 -0.0683653 0.8468511 0.0167292 -0.0859531 0.1921855 0.543748 -0.0767438 -0.1131224 -0.0554611 -0.0675274 -0.0867121 0.0016894 0.0665592 0.06883 0.0178862 -0.1295062 0.0719845 -0.0721639 -0.0418429 0.0829682 0.0381682 -0.0578373 -0.0596156 -0.0129789 0.0721855 -0.0366217 0.0398209 0.0459023 -0.0003642 0.0848753 0.0175185 0.0500395 0.0697763 0.0091107 0.0212456 0.0066713 0.1932041 0.0611645 -0.0718142 0.0187382 -0.0253917 -0.0511941 0.0224784 0.0179156 0.0268566 0.1991379 0.0481305 0.0848986 0.0881649 0.0628713 0.039202 -0.0773461 0.0533784 -0.0560008 -0.0133097 -0.1612953 -0.1184687 0.0120768 -0.1419893 0.0455368 0.0155671 0.0081758 0.0224679 0.0756117 0.1025851 0.0157613 -0.0296757 0.0652351 -0.1052583 0.1049835 -0.0336583 0.0527778 0.0265759 0.0726466 0.0399509 0.0013319 0.0414951 -0.1042646 0.0169565 0.0021676 0.0154154 0.1243655 0.1932993 0.0545331 0.0169131 0.0900393 0.1627629 0.009459 0.0115779 0.0109745 0.3769884 0.2628373 0.0173637 0.0118907 0.0103481 0.1691676 0.0160513 0.0110094 0.0152882 0.3759114 unknown
polarizability: 156.3553229|-2.5113244|124.3885796|-5.5432483|-4.374965|58.5593681 unknown
InChI: InChI=1S/C8H10N4/c1-2-12-4-3-6-7(9)10-5-11-8(6)12/h3-5H,2,9H2,1H3
charge 0 multiplicity 1
22 atoms
N  1.509467 -0.332484 -0.278161
N  0.045777 1.640607 -0.280513
N  -2.329307 1.111192 0.020083
N  -3.157048 -1.062689 0.290986
C  0.26741 0.294448 -0.189835
C  -0.728356 -0.719107 0.00444
C  2.794486 0.373316 -0.434156
C  1.314614 -1.715501 -0.133818
C  -0.044621 -1.990395 0.036673
C  -2.071242 -0.23463 0.105998
C  3.536649 0.560262 0.905499
C  -1.272219 1.962602 -0.166168
H  3.419084 -0.189252 -1.152359
H  2.559668 1.356875 -0.876095
H  2.160428 -2.400043 -0.172086
H  -0.471039 -2.984206 0.163138
H  2.924668 1.153777 1.605782
H  4.489002 1.095383 0.738634
H  3.765528 -0.410895 1.37953
H  -1.52269 3.025826 -0.230994
H  -3.054114 -2.070219 0.361691
H  -4.078347 -0.634266 0.352931
