program: Gaussian 09
title: 000267607
version: EM64L-G09RevD.01
frameworkgroup: C1[X(C21H24N8O5)]
method: RPBEPBE
basis: SDD
operation: Freq
keyword: #p
keyword: freq=noraman
keyword: PBEPBE/SDD
title: #p freq=noraman PBEPBE/SDD
converged: YES YES NO NO
title: Mulliken charges:
elementType: O O O O O N N N N N N N N C C C C C C C C C C C C C C C C C C C C C H H H H H H H H H H H H H H H H H H H H H H H H
charge: -0.298449 -0.407615 -0.238330 -0.399685 -0.279950 -0.170777 -0.465636 -0.029135 0.048322 -0.028974 -0.087147 -0.611566 -0.579942 -0.118445 0.470822 -0.545951 -0.473292 -0.388520 0.274944 -0.511878 -0.362512 -0.412193 0.170964 0.179750 -0.399200 -0.361771 -0.668509 0.193186 -0.391643 -0.113556 0.238213 -0.051368 0.144366 -0.036865 0.293272 0.257736 0.248784 0.247513 0.240278 0.228972 0.231305 0.376503 0.301583 0.258702 0.232073 0.229570 0.271962 0.232693 0.215892 0.240222 0.218890 0.275702 0.376920 0.383616 0.330748 0.350462 0.330832 0.338114
chargesum: 0.00000
title: Mulliken charges with hydrogens summed into heavy atoms:
elementType: O O O O O N N N N N N N N C C C C C C C C C C C C C C C C C C C C C
charge: -0.298449 -0.030695 -0.238330 -0.016070 -0.279950 -0.170777 -0.089133 -0.029135 0.048322 -0.028974 -0.087147 0.069644 0.089004 0.174828 0.470822 -0.039431 0.014499 0.071757 0.274944 0.048406 -0.130438 -0.182624 0.170964 0.179750 -0.127238 -0.129079 0.006496 0.193186 -0.115941 -0.113556 0.238213 -0.051368 0.144366 -0.036865
polarizability: 5.31083575e+02 -5.52157375e-01 2.84101689e+02 9.06802372e+00 -1.15565188e+01 2.33521922e+02
1716.lowfreq: -4.9171 -3.2448 -0.0009 0.0001 0.0011 1.2885 4.7939 6.6804 15.6434
frequency: -3.6323 6.4630 15.6065 31.1636 34.6599 41.4479 44.5232 47.1721 59.3573 68.9954 75.2150 90.8562 100.3922 111.2739 127.4881 134.6235 147.8849 161.0948 171.9756 189.6211 196.5241 206.8167 208.5060 225.3491 254.2994 261.6536 285.7085 300.1096 310.0703 318.0931 326.7209 350.6265 371.6915 386.4314 409.8488 425.1267 432.8041 437.3906 450.6635 478.8185 485.6416 501.4108 508.2566 511.6724 529.7225 536.2881 544.6232 547.7118 553.9609 563.4810 572.5168 580.1587 598.5841 614.6556 621.9295 633.9968 642.0733 653.1448 671.6856 686.4898 690.4538 693.8277 707.8551 714.8947 735.4494 742.8571 758.9461 780.8211 790.4355 808.0168 813.7911 818.6419 825.4560 836.3788 847.5766 877.7805 905.7719 917.3612 929.6515 932.9967 938.8226 946.1632 984.1863 987.8298 996.7144 1016.9914 1022.6299 1036.0037 1036.9588 1072.7297 1076.2518 1083.2396 1100.9188 1113.0059 1121.7028 1134.6025 1137.4734 1168.4941 1183.8590 1192.5052 1216.4312 1235.8526 1246.6353 1247.9266 1251.7211 1256.5868 1267.4191 1276.6452 1281.8092 1290.8507 1317.5423 1323.1688 1332.8426 1348.0044 1352.5087 1353.9330 1368.8550 1371.4274 1375.2575 1383.9829 1388.6547 1400.1172 1412.7567 1436.0235 1436.5109 1448.8719 1460.1528 1465.5747 1469.8432 1477.9562 1484.1753 1495.1623 1502.9440 1505.5032 1527.0216 1528.6514 1546.1710 1560.0651 1585.0812 1599.0160 1621.0726 1627.5958 1639.0848 1657.4269 2979.0508 2984.2300 2985.9481 2997.8643 3008.2564 3025.5323 3035.7343 3048.0320 3067.1209 3074.4749 3079.3979 3093.3924 3129.2369 3141.0340 3143.6782 3160.3266 3164.6576 3421.0477 3510.1835 3519.6133 3520.9506 3556.2204 3683.8616 3717.0485
redmass: 6.3601 6.7387 6.7811 4.8885 6.0951 4.7686 5.6684 6.9684 3.9878 5.3216 8.6798 8.2247 4.2165 7.1228 6.2317 4.2110 4.3047 5.0053 5.4806 5.6831 4.6781 6.4759 1.6713 2.1680 4.1336 4.2271 3.4825 3.2125 2.9847 4.4628 5.0139 5.7836 5.0498 3.3808 2.9557 3.5229 4.1314 2.3848 3.3014 4.5741 1.1997 5.8246 3.4152 2.9320 3.5312 3.1915 2.0873 2.8022 1.7007 1.9989 2.0572 1.7490 2.8799 3.9669 1.0728 6.7701 7.2546 2.0278 2.3876 4.3267 4.6302 4.1748 4.8404 1.2875 6.4339 6.0334 4.5707 3.1305 1.3494 1.3534 4.1284 4.4081 10.6955 1.7571 4.1543 2.2207 3.5144 3.5126 1.5243 2.2103 3.5465 1.3893 2.3051 1.3624 3.1721 2.5209 2.4030 3.1785 3.2300 2.5190 2.0250 2.3631 3.4878 2.6780 1.9861 2.1864 1.4768 1.8953 1.9919 1.3391 1.2465 2.4619 1.4608 2.4822 1.3959 2.7359 1.6225 5.4647 1.3128 1.4494 1.6397 1.6322 2.0255 1.5566 1.5429 1.5565 3.8205 1.7587 7.8972 1.7978 1.2437 2.1022 3.8409 1.8683 1.5087 4.8890 1.0940 1.2606 1.0671 2.2839 1.1190 1.2388 2.2372 2.1486 3.8774 4.0459 3.6087 2.7110 4.7158 1.8072 2.2937 5.6723 6.4625 8.0211 1.0678 1.0378 1.0577 1.0616 1.0641 1.0821 1.1014 1.1020 1.0972 1.0968 1.0996 1.1009 1.0886 1.0882 1.0908 1.0942 1.0955 1.0824 1.0640 1.0641 1.0446 1.0441 1.1047 1.1060
irintensity: 0.8124 0.8527 0.5955 1.2473 1.6625 1.0769 0.8080 2.0883 0.4914 4.8655 0.1241 0.6929 2.0073 3.2112 4.3859 1.4813 1.7846 4.6115 7.9299 2.2385 0.8128 6.1634 0.7143 3.1613 1.1579 9.3182 1.7098 1.7011 15.8966 5.0189 5.2967 1.2587 17.2972 17.1497 1.7437 1.2133 8.3191 24.3487 7.2127 14.1787 203.5268 6.5920 33.5208 21.7896 22.1164 10.8437 119.8225 76.9511 82.9470 3.1920 77.9579 60.5722 52.0463 8.9979 53.2722 1.7061 1.4739 62.8630 37.1921 50.6759 39.6049 57.0247 6.5810 38.3325 10.9637 9.0649 32.7574 8.2531 7.5204 20.5845 5.5915 6.9879 8.3372 44.5390 17.9396 16.4493 0.1396 14.5947 2.3106 11.1254 8.4783 4.6214 49.4006 1.7966 0.5185 19.2437 2.3104 10.6117 412.0854 246.6880 25.0637 62.9304 8.0362 37.7810 48.9135 3.7617 37.7130 3.5841 46.1349 4.7792 163.8255 25.7992 4.8870 40.3141 20.6600 28.2607 53.0708 18.7999 45.1191 9.9655 151.9591 107.3193 201.2815 15.4059 69.1087 2.5069 18.3196 58.9986 95.7296 41.9989 29.8120 110.7730 148.3280 45.8399 21.9869 160.4412 35.3860 5.2757 1.1921 58.6473 18.3967 138.7129 606.4354 57.8202 113.8262 135.9059 136.4259 376.1825 163.3376 878.4762 427.7661 278.7066 152.7864 185.3063 22.3092 18.7663 38.1956 35.1961 10.2600 25.7161 7.4984 5.9525 2.7405 20.5251 41.4941 43.5136 8.1768 28.7449 3.2638 18.3395 14.7143 366.0993 28.0581 36.2793 86.5098 199.9869 74.8039 50.7539
temp: 298.150 k
press: 1.00000 atm
elementType: 8 8 8 8 8 7 7 7 7 7 7 7 7 6 6 6 6 6 6 6 6 6 6 6 6 6 6 6 6 6 6 6 6 6 1 1 1 1 1 1 1 1 1 1 1 1 1 1 1 1 1 1 1 1 1 1 1 1
symmnumber: 1
zpe: 1176867.3 jmol-1
zpe.correction: 0.448245 hartree
zpe.thermalcorrener: 0.479483 hartree
zpe.thermalcorrenthalpy: 0.480427 hartree
zpe.thermalcorrgfe: 0.382093 hartree
zpe.sumelectzpe: -1626.355834 hartree
zpe.sumelectthermal: -1626.324596 hartree
zpe.sumelectthermalent: -1626.323652 hartree
zpe.sumelectthermalfe: -1626.421986 hartree
dipole: 1.5581 6.2711 0.2141
dipole: 6.4653
quadrupole: -122.2611 -185.6759 -199.2089
quadrupole: -4.9711 -21.9396 2.3816
quadrupole: 46.7875 -16.6273 -30.1603 -4.9711 -21.9396 2.3816
hfenergy: -1626.804079 hartree
pointgroup: C01 [X(C21H24N8O5)]
dipole: 0.5313843 -2.37329 -0.745175 debye
polarizability: 527.0416183|1.3366395|286.5173903|-35.7573069|1.962715|235.1481771 unknown
InChI: InChI=1S/C21H24N8O5/c1-2-29(10-12-9-24-18-16(25-12)17(22)27-21(23)28-18)13-5-3-11(4-6-13)19(32)26-14(20(33)34)7-8-15(30)31/h3-6,9,14,26,30,33H,2,7-8,10,22-23H2,1H3
charge 0 multiplicity 1
58 atoms
O  -3.543782 1.386937 2.500497
O  -6.604176 2.837228 2.520957
O  -5.577698 2.912442 0.437259
O  -7.214451 -0.54551 -2.895202
O  -5.683665 -1.264247 -1.323299
N  1.363356 -1.915988 -0.224579
N  -4.778073 0.122551 1.022418
N  4.868988 -0.771788 0.105005
N  3.825934 1.396887 -1.465744
N  6.035531 2.222488 -1.780815
N  7.958108 1.031849 -0.76632
N  7.623926 -0.919715 0.511959
N  8.231503 2.965928 -2.039411
C  -6.009116 0.714873 1.537943
C  0.155496 -1.336811 0.194915
C  2.621563 -1.695701 0.500047
C  -7.257031 0.153788 0.796897
C  1.417318 -2.89455 -1.331193
C  -2.326667 -0.15264 1.06047
C  -7.354099 0.472627 -0.719938
C  0.130696 -0.281329 1.164028
C  -1.101548 -1.76583 -0.340059
C  3.537795 -0.645991 -0.123358
C  -3.566144 0.503471 1.574113
C  -1.082087 0.2828 1.584139
C  -2.307977 -1.182587 0.082021
C  1.159963 -4.354318 -0.887665
C  -5.981928 2.248153 1.416754
C  3.040485 0.447533 -0.912217
C  5.68506 0.182923 -0.443233
C  -6.657633 -0.524356 -1.62099
C  5.194266 1.283006 -1.237927
C  7.12739 0.108855 -0.236406
C  7.361252 2.043778 -1.514435
H  -6.113078 0.497446 2.616899
H  2.405692 -1.427016 1.550852
H  3.192238 -2.642983 0.546168
H  -7.287782 -0.940004 0.958194
H  -8.147154 0.577097 1.294906
H  0.695787 -2.596798 -2.113296
H  2.419406 -2.821041 -1.794433
H  -4.854435 -0.523835 0.227637
H  -6.910432 1.468071 -0.930807
H  -8.407783 0.531223 -1.042009
H  1.062917 0.121117 1.572188
H  -1.14303 -2.571298 -1.078448
H  -1.095948 1.089683 2.324513
H  -3.236293 -1.560062 -0.362435
H  1.909146 -4.67935 -0.142816
H  0.160833 -4.464055 -0.431838
H  1.22483 -5.037681 -1.75455
H  1.964555 0.537212 -1.095948
H  -6.573791 3.827235 2.424249
H  -6.702939 -1.171898 -3.476919
H  8.625339 -0.991008 0.675635
H  6.962513 -1.592923 0.89931
H  9.227264 2.869835 -1.860759
H  7.85639 3.732676 -2.592023
