program: Gaussian 09
title: 000267485
version: EM64L-G09RevD.01
frameworkgroup: C1[X(C16H18N2O4)]
method: RPBEPBE
basis: SDD
operation: Freq
keyword: #p
keyword: freq=noraman
keyword: PBEPBE/SDD
title: #p freq=noraman PBEPBE/SDD
converged: YES YES NO NO
title: Mulliken charges:
elementType: O O O O N N C C C C C C C C C C C C C C C C H H H H H H H H H H H H H H H H H H
charge: -0.244033 -0.230120 -0.266507 -0.225051 0.047026 -0.409331 0.224404 0.204195 0.501637 -0.512648 -0.340435 -0.437466 -0.241825 -0.245491 -0.399854 -0.685978 -0.682663 0.193601 0.183255 -0.332015 -0.250109 -0.146586 0.304788 0.247516 0.222028 0.215626 0.215554 0.208770 0.208800 0.208216 0.230970 0.230973 0.208180 0.234935 0.234905 0.204569 0.313004 0.284515 0.259305 0.263341
chargesum: 0.00000
title: Mulliken charges with hydrogens summed into heavy atoms:
elementType: O O O O N N C C C C C C C C C C C C C C C C
charge: -0.244033 -0.230120 -0.266507 -0.225051 0.047026 -0.096327 0.224404 0.204195 0.501637 -0.207860 -0.092919 -0.215439 0.189355 0.172078 -0.191638 -0.015854 -0.008254 0.193601 0.183255 -0.047500 0.009196 0.116755
polarizability: 4.63745865e+02 -2.08781746e+01 2.24103078e+02 -6.49322047e-03 -6.25518372e-02 9.83033644e+01
1716.lowfreq: -0.6523 -0.0009 -0.0007 0.0008 4.7298 7.9908 23.5408 26.5640 32.3439
frequency: 23.5262 26.5606 32.3360 54.5151 70.4291 81.5903 84.1265 101.7666 112.6703 120.6237 130.0035 148.3524 177.4767 208.4299 227.6241 231.0670 241.3155 243.2833 245.9826 301.6751 306.7282 318.6830 352.9323 380.0768 408.3318 461.4001 468.1989 492.1985 532.6581 584.4259 586.2447 587.3805 625.2515 635.2294 675.3449 717.7853 735.0961 736.0618 745.1431 755.9002 794.3532 827.2378 828.3217 832.1248 840.3772 869.1106 872.1469 893.7893 898.8643 899.7967 903.6589 910.8163 945.2769 993.7342 1006.3411 1027.5648 1032.2411 1033.6427 1047.9162 1114.1318 1114.4913 1117.1122 1131.9992 1134.6976 1135.0820 1135.2529 1180.6083 1203.1196 1222.5175 1253.1895 1260.5791 1264.1859 1265.8491 1277.4143 1340.1569 1358.8101 1366.7742 1369.6843 1396.1293 1400.1302 1407.3289 1433.5282 1460.2923 1461.0448 1469.2929 1475.1837 1476.8355 1486.1232 1488.2568 1503.4614 1522.6739 1559.6582 1577.9966 1592.0927 1606.4887 1618.1398 2954.6111 2962.7666 2966.7064 2997.6517 2998.1037 3013.9451 3021.9819 3094.9814 3095.4132 3106.4545 3108.7727 3127.9156 3168.6413 3170.9891 3227.2143 3247.2525 3268.2249 3378.3904
redmass: 5.4601 5.2456 5.3567 4.5869 3.7248 3.8933 4.8526 3.9827 1.7116 2.1403 3.6242 5.0140 5.8278 5.2409 4.4315 2.5734 5.9843 1.3398 1.2320 5.5722 4.4531 4.4093 4.2438 5.4192 5.1480 8.1141 3.1579 5.7575 5.4240 5.8693 4.2616 3.8968 3.4606 5.9698 1.2080 5.5424 5.2461 1.2989 3.1751 4.4216 1.4400 1.1068 7.0141 1.1144 1.3278 6.2652 3.6488 4.0052 1.4348 1.3903 3.5654 1.3687 1.5845 2.9702 1.6666 3.6769 2.7616 2.5978 4.4245 2.4329 2.5366 2.2913 2.0607 1.4383 1.9774 1.4441 2.0456 1.6805 1.9714 3.1701 3.1598 1.1408 1.1367 1.3445 1.8152 2.5359 1.3212 1.4490 1.6269 1.2718 2.2328 5.3548 1.0397 1.0397 4.4809 1.1870 1.0600 1.1543 1.0910 1.9485 2.0533 6.8268 7.1805 6.2959 6.3746 6.5887 1.0552 1.0558 1.0868 1.0363 1.0363 1.1075 1.1075 1.0989 1.0988 1.1013 1.1014 1.0892 1.0920 1.0928 1.0914 1.0992 1.1092 1.0756
irintensity: 1.7142 1.6688 1.4612 0.0072 10.7203 3.8416 2.9376 0.1401 1.7813 0.7742 0.9717 3.5177 1.0504 0.1419 3.0289 9.5755 15.8877 0.1076 0.0312 14.2230 2.0557 2.0266 0.3045 4.7298 0.0336 3.2905 1.5450 13.3492 5.4930 5.5163 9.9797 0.7813 5.3437 16.4058 87.3286 4.8405 18.3179 103.1938 1.3385 3.2695 39.1244 8.8050 64.9569 0.0620 22.7249 13.0545 16.1467 15.8819 4.8615 0.9799 49.2757 13.6915 40.1876 31.2569 52.1269 12.1618 132.4065 36.8708 6.2731 14.9599 66.7511 26.1200 148.5817 3.6314 178.1008 6.3268 54.1940 62.9204 95.5192 263.5796 502.6681 0.0259 0.0157 0.2356 56.3731 4.8811 13.9123 7.4004 54.7179 11.4649 8.4647 69.3077 7.1899 16.5713 12.7915 105.6658 19.3712 93.7640 10.1345 265.3270 120.0181 25.3408 94.2417 87.2208 169.3826 148.0387 52.0325 23.3742 63.0515 22.2391 35.7968 34.9862 30.0077 39.5534 14.7847 33.0574 34.5501 13.3876 12.8808 16.2324 4.1232 1.5773 0.2312 8.0061
temp: 298.150 k
press: 1.00000 atm
elementType: 8 8 8 8 7 7 6 6 6 6 6 6 6 6 6 6 6 6 6 6 6 6 1 1 1 1 1 1 1 1 1 1 1 1 1 1 1 1 1 1
symmnumber: 1
zpe: 822528.7 jmol-1
zpe.correction: 0.313285 hartree
zpe.thermalcorrener: 0.335000 hartree
zpe.thermalcorrenthalpy: 0.335944 hartree
zpe.thermalcorrgfe: 0.260206 hartree
zpe.sumelectzpe: -1029.216320 hartree
zpe.sumelectthermal: -1029.194605 hartree
zpe.sumelectthermalent: -1029.193661 hartree
zpe.sumelectthermalfe: -1029.269399 hartree
dipole: -0.6120 -4.6765 0.0046
dipole: 4.7164
quadrupole: -86.2619 -113.7491 -133.5497
quadrupole: 4.2832 0.0344 0.0002
quadrupole: 24.9250 -2.5622 -22.3628 4.2832 0.0344 0.0002
hfenergy: -1029.5296048 hartree
pointgroup: C01 [X(C16H18N2O4)]
dipole: 0.2620141 -1.8368405 0.0225195 debye
polarizability: 462.8930054|23.4562106|224.5599155|-11.4520923|-2.8657416|98.6993863 unknown
InChI: InChI=1S/C16H18N2O4/c1-3-20-13-8-7-12(10-15(13)21-4-2)11-17-18-16(19)14-6-5-9-22-14/h5-11,18H,3-4H2,1-2H3
charge 0 multiplicity 1
40 atoms
O  -3.607622 1.675765 0.246493
O  -5.129279 -0.488218 0.33196
O  5.298029 -1.057421 0.022024
O  3.28023 1.999525 0.031837
N  1.323243 -0.05712 0.124787
N  2.685245 -0.292282 0.088227
C  -2.925281 0.45813 0.246585
C  -3.754593 -0.718023 0.292981
C  -0.920723 -0.968131 0.208517
C  -1.52852 0.322649 0.205109
C  -3.14838 -1.99462 0.295944
C  -1.742586 -2.119398 0.254011
C  -2.790351 2.908403 0.197797
C  -6.021518 -1.665395 0.377824
C  0.534001 -1.11429 0.166406
C  -3.766443 4.080585 0.205327
C  -7.449313 -1.128152 0.410542
C  5.006468 0.335218 0.008462
C  3.593677 0.776428 0.043516
C  6.19438 1.050223 -0.038081
C  7.273442 0.089809 -0.054597
C  6.698232 -1.170609 -0.017524
H  -0.867051 1.192066 0.169235
H  -3.765099 -2.896792 0.330641
H  -1.287357 -3.116899 0.257186
H  -2.114835 2.935552 1.076967
H  -2.170032 2.901075 -0.72151
H  -5.845739 -2.294913 -0.518815
H  -5.793342 -2.264806 1.283275
H  0.929924 -2.151129 0.172266
H  -4.383601 4.067811 1.119769
H  -4.439653 4.032552 -0.667456
H  -3.210172 5.034867 0.169023
H  -7.656186 -0.521815 -0.487388
H  -7.604694 -0.493524 1.299264
H  -8.169899 -1.965557 0.444597
H  3.064503 -1.25262 0.093487
H  6.265117 2.135055 -0.057375
H  8.339077 0.306264 -0.089522
H  7.090603 -2.183761 -0.012989
