program: Gaussian 09
title: 000267447
version: EM64L-G09RevD.01
frameworkgroup: C1[X(C13H24N2O6)]
method: RPBEPBE
basis: SDD
operation: Freq
keyword: #p
keyword: freq=noraman
keyword: PBEPBE/SDD
title: #p freq=noraman PBEPBE/SDD
converged: YES YES NO NO
title: Mulliken charges:
elementType: O O O O O O N N C C C C C C C C C C C C C H H H H H H H H H H H H H H H H H H H H H H H H
charge: -0.321084 -0.460745 -0.265942 -0.267399 -0.233638 -0.353489 -0.359473 -0.379050 -0.179924 0.330991 -0.082905 -0.208387 0.233268 -0.706717 -0.700210 -0.697595 -0.706416 0.230572 -0.740334 0.352546 -0.498486 0.276024 0.241284 0.256983 0.343911 0.213348 0.220375 0.269176 0.228606 0.228931 0.207064 0.258691 0.220052 0.214165 0.337179 0.235452 0.228853 0.220130 0.251775 0.239645 0.225158 0.372004 0.248184 0.242901 0.234527
chargesum: 0.00000
title: Mulliken charges with hydrogens summed into heavy atoms:
elementType: O O O O O O N N C C C C C C C C C C C C C
charge: -0.321084 -0.088741 -0.265942 -0.267399 -0.233638 -0.353489 -0.015563 -0.041871 0.096101 0.330991 0.158379 0.048595 0.233268 -0.003818 -0.035610 -0.004687 -0.021981 0.230572 -0.023757 0.352546 0.227127
polarizability: 2.05903699e+02 -3.93937205e+00 1.77390096e+02 -2.88774699e+00 7.29491517e-01 1.49165138e+02
1716.lowfreq: -9.4219 -2.3318 -0.0003 0.0002 0.0009 10.1871 19.4562 30.2953 41.0263
frequency: 19.0017 30.2815 41.0016 53.8500 62.7562 74.1201 87.8228 89.9902 99.8200 109.5816 119.0127 127.5266 142.3744 175.3477 182.2764 197.7583 212.3225 221.0042 229.8667 240.2638 244.1985 245.6124 248.7756 282.6232 293.6306 298.4063 310.4786 325.6455 334.6422 355.3075 388.3814 417.7202 431.9415 436.1742 464.4669 506.2757 547.0228 574.9741 590.0029 641.4115 674.0734 696.8165 707.5323 708.2406 721.7006 734.1099 757.5275 808.1303 817.7052 839.9373 899.4684 900.3219 914.0069 917.9273 928.1924 955.0334 968.9323 1002.5135 1013.9351 1028.6994 1032.5190 1049.8288 1073.4044 1083.9338 1101.4393 1114.2721 1130.7698 1150.8298 1154.0423 1158.2367 1172.4880 1228.6328 1232.9126 1242.4522 1257.4980 1269.2202 1278.9890 1311.3328 1315.8505 1327.5917 1348.0239 1377.5678 1378.1487 1381.1114 1386.3186 1392.0804 1402.4470 1423.1933 1446.3348 1453.2157 1460.1309 1461.7041 1464.2383 1464.7434 1467.1873 1469.8479 1471.1970 1473.9190 1480.2380 1482.6683 1502.1562 1511.9577 1606.4543 1631.8025 1647.6287 2988.6796 2991.5008 2991.8375 2995.8733 2997.3546 3007.1246 3007.6824 3051.3500 3055.0308 3081.8251 3084.8662 3088.9520 3093.5584 3097.2693 3098.3056 3099.9540 3104.3039 3110.9647 3115.6645 3120.8637 3152.2921 3333.5148 3525.4256 3560.6665
redmass: 4.8018 3.5597 3.9849 5.2203 5.0900 4.7683 3.8969 3.9282 1.2043 3.1403 3.3664 4.1184 3.8699 1.2226 4.2648 3.8521 2.4587 1.7187 1.3309 2.1637 1.3239 1.4710 1.3822 3.5685 3.9020 3.6057 3.8494 3.7125 2.6082 4.6902 3.5548 2.9054 2.8327 3.5028 2.6735 2.5838 1.1708 1.4046 6.1745 3.6542 3.1489 6.8983 5.0203 8.1991 4.7994 1.2251 5.7655 4.0132 3.4887 4.2640 2.7269 2.6131 1.6205 1.7394 2.8360 1.2027 4.3191 2.7997 2.0605 1.4263 1.4288 1.8217 2.3596 2.2578 2.6200 1.2654 3.1655 1.4423 2.5579 2.6045 2.4739 1.5130 2.1251 1.5975 3.0308 2.9568 1.7334 1.4187 1.4452 1.3790 1.5737 1.2240 1.2106 1.2227 1.1818 1.2222 1.2133 1.1885 1.0467 1.0499 1.1430 1.1557 1.0506 1.0592 1.0522 1.0941 1.1557 1.2096 1.0518 1.0968 1.0644 1.8263 7.5177 7.4654 8.6025 1.0353 1.0365 1.0358 1.0357 1.0368 1.0293 1.0855 1.0846 1.0868 1.0993 1.0992 1.0992 1.0993 1.1013 1.0992 1.1004 1.0991 1.1048 1.0995 1.0990 1.1051 1.0690 1.0770 1.0777
irintensity: 0.2431 1.5453 0.6345 2.7662 11.0063 0.9166 2.2395 0.9177 1.8938 4.8576 1.6121 2.7473 9.2447 0.4571 4.1995 3.6412 4.8147 0.5906 1.4402 8.8358 1.3031 2.5163 7.6055 9.0651 33.9580 3.5258 20.1567 10.5664 3.8340 2.2695 5.8913 4.6857 3.6913 8.7780 7.1260 24.5601 96.5157 223.4490 5.5801 20.6382 23.9941 11.5945 9.2423 14.4476 27.6309 12.9055 8.6067 2.9943 31.2226 16.7483 7.8426 7.4940 1.6578 4.2147 7.5060 0.3018 14.1445 78.0343 76.1622 2.5550 5.8128 45.9892 75.9602 14.9070 107.4234 0.0486 29.5422 2.1681 281.3303 171.2217 87.2687 26.2308 156.7111 19.8544 28.6960 9.1121 118.1684 24.8187 34.3965 6.2490 11.9447 36.4583 47.0973 21.0054 15.8886 47.9564 23.1885 22.4217 1.3320 13.6469 65.5979 87.3425 12.8461 32.3788 6.7047 34.3363 35.5821 130.6399 1.3214 27.3720 46.6493 170.4760 177.0304 316.2068 125.7015 14.4447 24.4810 7.0983 22.4394 28.2691 35.4031 15.1141 0.5198 20.8034 16.1200 18.3020 33.4125 40.8504 13.9835 50.5529 29.2258 18.7617 23.2384 6.5131 14.5232 14.9590 308.1871 42.1795 45.7628
temp: 298.150 k
press: 1.00000 atm
elementType: 8 8 8 8 8 8 7 7 6 6 6 6 6 6 6 6 6 6 6 6 6 1 1 1 1 1 1 1 1 1 1 1 1 1 1 1 1 1 1 1 1 1 1 1 1
symmnumber: 1
zpe: 971809.7 jmol-1
zpe.correction: 0.370143 hartree
zpe.thermalcorrener: 0.395425 hartree
zpe.thermalcorrenthalpy: 0.396369 hartree
zpe.thermalcorrgfe: 0.314382 hartree
zpe.sumelectzpe: -1068.993378 hartree
zpe.sumelectthermal: -1068.968096 hartree
zpe.sumelectthermalent: -1068.967152 hartree
zpe.sumelectthermalfe: -1069.049139 hartree
dipole: -2.2673 0.1727 0.0304
dipole: 2.2740
quadrupole: -99.9947 -122.7981 -133.9728
quadrupole: -4.4914 0.6880 -8.1220
quadrupole: 18.9272 -3.8762 -15.0509 -4.4914 0.6880 -8.1220
hfenergy: -1069.3635205 hartree
pointgroup: C01 [X(C13H24N2O6)]
dipole: 0.8929337 0.0485631 -0.0273684 debye
polarizability: 205.9423387|3.3282238|177.2405934|-3.8811663|-0.5085691|149.2760013 unknown
InChI: InChI=1S/C13H24N2O6/c1-7(14-12(19)21-13(3,4)5)10(17)15-9(8(2)16)11(18)20-6/h7-9,14-16H,1-6H3
charge 0 multiplicity 1
45 atoms
O  3.290614 0.14812 -0.009639
O  -0.978969 -1.946726 0.271185
O  -4.538755 -0.925229 -0.072198
O  -0.877494 2.272289 -1.520133
O  -3.504705 -0.030158 1.816209
O  1.227312 -0.302488 1.07148
N  -1.393206 0.885735 0.291082
N  1.750332 1.793408 0.17316
C  -2.361693 0.022832 -0.381826
C  3.843106 -1.271928 0.137565
C  -1.677351 -1.324248 -0.85232
C  0.477947 2.451239 0.54834
C  -0.673848 1.877883 -0.331488
C  3.943576 -1.628726 1.633547
C  5.233275 -1.129366 -0.505502
C  2.951857 -2.249911 -0.652603
C  -0.760756 -1.111566 -2.069264
C  -3.498627 -0.283298 0.591441
C  0.60428 3.968699 0.350965
C  2.024907 0.476109 0.460866
C  -5.68069 -1.346021 0.777479
H  -2.758535 0.546623 -1.269339
H  -2.483782 -2.032703 -1.108039
H  0.278196 2.215442 1.611087
H  -1.149758 0.621777 1.249909
H  4.453815 -2.603225 1.741408
H  4.536234 -0.869133 2.173549
H  2.94572 -1.700426 2.093229
H  5.832413 -0.371103 0.027247
H  5.145464 -0.826558 -1.563061
H  5.766279 -2.095532 -0.458765
H  1.958905 -2.362933 -0.189985
H  2.826272 -1.902855 -1.693739
H  3.436851 -3.242749 -0.678936
H  2.427409 2.310009 -0.390719
H  0.040631 -0.382592 -1.855997
H  -0.29513 -2.07506 -2.341597
H  -1.331077 -0.734382 -2.937027
H  0.704136 4.203148 -0.723401
H  -0.304821 4.474758 0.716283
H  1.471728 4.367189 0.906194
H  -0.18416 -1.39466 0.535413
H  -5.333374 -2.041367 1.5595
H  -6.144779 -0.465256 1.251849
H  -6.377448 -1.838958 0.085692
