program: Gaussian 09
title: 000267438
version: EM64L-G09RevD.01
frameworkgroup: C1[X(C17H14N2O2)]
method: RPBEPBE
basis: SDD
operation: Freq
keyword: #p
keyword: freq=noraman
keyword: PBEPBE/SDD
title: #p freq=noraman PBEPBE/SDD
converged: YES YES NO NO
title: Mulliken charges:
elementType: O O N N C C C C C C C C C C C C C C C C C H H H H H H H H H H H H H H
charge: -0.323738 -0.263319 -0.308680 0.002549 0.281581 0.148394 -0.173775 0.238189 0.439048 -0.274249 -0.359343 -0.222953 -0.492008 -0.378397 0.279325 -0.434520 -0.256370 -0.246844 -0.148644 -0.244699 -0.660306 0.307083 0.230335 0.283090 0.243289 0.242165 0.223431 0.244997 0.229032 0.231207 0.222886 0.240187 0.218952 0.249600 0.232504
chargesum: 0.00000
title: Mulliken charges with hydrogens summed into heavy atoms:
elementType: O O N N C C C C C C C C C C C C C C C C C
charge: -0.323738 -0.263319 -0.308680 0.002549 0.281581 0.148394 0.133308 0.238189 0.439048 -0.043914 -0.076253 0.020335 -0.249844 -0.154966 0.279325 -0.189523 -0.027337 -0.015638 -0.148644 0.218374 0.040750
polarizability: 3.21627739e+02 -1.08342579e+01 2.00168181e+02 -5.51030811e-01 -1.75655080e+01 1.22349293e+02
1716.lowfreq: -8.9605 -5.0892 0.0001 0.0004 0.0007 3.1078 28.4329 38.4013 47.1538
frequency: 28.4096 38.3521 47.0835 67.7312 86.4213 92.8744 122.2360 137.6469 156.9634 201.4233 220.8511 244.0284 252.3641 265.3304 321.1474 333.7329 388.9069 396.4692 420.5753 433.3341 441.7483 474.2092 489.0083 516.3747 525.2680 552.3178 558.1937 601.5602 647.5439 668.1111 691.4313 694.4427 717.8388 736.0180 756.3531 770.0622 800.9392 813.4462 822.5876 836.5853 866.7152 878.3403 883.3026 915.4246 950.8433 955.3944 972.4690 990.5968 991.9399 1004.6672 1026.1179 1038.1986 1068.5086 1096.8605 1115.7849 1154.2528 1159.4600 1174.5088 1184.9240 1213.8315 1238.8306 1241.6967 1265.7548 1269.5788 1281.0507 1283.9512 1339.3287 1356.8299 1363.9323 1393.0863 1396.7361 1411.0242 1417.4958 1439.5182 1457.6869 1462.1822 1464.2306 1483.8716 1519.4484 1568.9873 1597.1364 1628.2046 1637.1405 1648.8649 2183.3736 2994.5500 3033.5186 3063.1048 3090.1008 3095.5526 3121.5434 3124.4437 3133.9842 3136.8349 3146.8494 3153.7622 3166.3863 3176.4779 3206.6744
redmass: 4.7355 7.4773 3.2515 5.3486 4.7470 6.3381 5.5697 3.1469 4.3248 1.5580 2.9037 5.8049 3.0064 6.6277 4.1327 4.6612 4.1663 6.2521 3.8815 3.5599 5.7917 4.5619 6.6332 4.4218 3.8433 6.2137 3.9438 5.1291 6.3044 2.9144 5.9955 6.9915 5.1611 1.8987 1.3980 2.8175 2.6264 1.4581 1.6124 3.8944 4.3053 2.9135 2.1056 5.2450 1.3377 1.3304 1.4051 3.3792 1.4045 2.8333 3.5472 2.6184 4.0045 2.1780 2.8414 1.5959 1.4462 1.1017 1.2005 1.8613 2.4809 1.9007 2.1238 1.5756 1.1126 1.7533 2.1201 1.3491 1.6521 1.2361 2.4306 2.7278 4.3670 3.5817 1.0957 1.0662 2.3931 1.0521 3.6605 8.0456 6.0596 6.6596 9.9631 7.0034 12.5717 1.0362 1.0593 1.0829 1.0973 1.1034 1.1064 1.0862 1.0887 1.0906 1.0897 1.0909 1.0999 1.0998 1.0939
irintensity: 0.9833 1.5518 0.5511 2.4316 2.9465 0.5601 1.6952 0.1920 0.4727 4.8290 6.8060 1.3405 0.6871 1.9346 9.4464 15.4208 3.7239 1.4514 5.0247 12.1862 1.6238 3.6773 3.7764 1.2560 0.3510 0.7477 3.4536 1.4829 5.4625 4.4484 17.1660 12.4737 3.7832 37.5720 49.1922 11.9805 0.6226 0.5680 55.8445 8.4281 9.7314 19.0845 13.5432 40.0107 0.1531 1.6746 4.6192 0.3439 0.2297 12.0652 108.5974 129.8003 161.6392 30.5392 18.2698 72.8209 12.3743 2.2023 11.5641 72.1598 274.5778 177.4701 39.6695 20.2840 2.6171 229.8369 2.9981 19.6380 109.8713 25.3307 3.2578 15.2205 7.4652 0.0839 30.8068 11.8522 35.3502 18.2270 36.3992 1.4522 18.6450 28.7576 251.4370 26.6522 0.1570 18.3522 35.7310 9.5697 38.0566 0.7387 28.3935 1.3789 2.8376 12.3653 5.7148 25.7287 28.1895 18.6702 1.9674
temp: 298.150 k
press: 1.00000 atm
elementType: 8 8 7 7 6 6 6 6 6 6 6 6 6 6 6 6 6 6 6 6 6 1 1 1 1 1 1 1 1 1 1 1 1 1 1
symmnumber: 1
zpe: 705831.3 jmol-1
zpe.correction: 0.268837 hartree
zpe.thermalcorrener: 0.286809 hartree
zpe.thermalcorrenthalpy: 0.287753 hartree
zpe.thermalcorrgfe: 0.221755 hartree
zpe.sumelectzpe: -914.688106 hartree
zpe.sumelectthermal: -914.670134 hartree
zpe.sumelectthermalent: -914.669190 hartree
zpe.sumelectthermalfe: -914.735188 hartree
dipole: -0.2653 -0.0122 -2.8789
dipole: 2.8911
quadrupole: -93.0193 -118.8980 -132.9388
quadrupole: 1.8982 6.0328 -16.8390
quadrupole: 21.9327 -3.9460 -17.9867 1.8982 6.0328 -16.8390
hfenergy: -914.9569427 hartree
pointgroup: C01 [X(C17H14N2O2)]
dipole: 0.0427975 -0.2427258 1.1104376 debye
polarizability: 321.4488053|5.0731896|189.1585308|11.9063373|32.0614373|133.5378778 unknown
InChI: InChI=1S/C17H14N2O2/c1-2-21-17(20)19-13(11-18)8-9-15-14-6-4-3-5-12(14)7-10-16(15)19/h3-10,13H,2H2,1H3
charge 0 multiplicity 1
35 atoms
O  3.655522 -0.154727 0.797535
O  2.330666 -2.054038 0.44542
N  1.400796 0.127547 0.418775
N  2.018868 2.893676 -1.682743
C  0.052464 -0.254474 0.082954
C  -1.011442 0.560284 0.549046
C  1.682397 1.574796 0.635473
C  -2.37638 0.211576 0.212901
C  -2.629744 -0.978171 -0.57237
C  -0.690372 1.718644 1.387126
C  -0.208331 -1.42114 -0.70139
C  0.575285 2.21373 1.461198
C  -1.519944 -1.769072 -1.012645
C  -3.504079 1.000375 0.620799
C  2.440455 -0.807691 0.539816
C  -3.976186 -1.338703 -0.904513
C  -4.808047 0.625362 0.284887
C  -5.05186 -0.555513 -0.483045
C  1.867128 2.294197 -0.662532
C  4.851515 -1.045096 0.921201
C  5.455637 -1.330098 -0.454936
H  2.643079 1.638641 1.171165
H  -1.482413 2.187383 1.978207
H  0.621611 -2.043028 -1.036623
H  0.839656 3.07296 2.083686
H  -1.713248 -2.662924 -1.616709
H  -3.351893 1.920947 1.192491
H  -4.146135 -2.243291 -1.50026
H  -5.652416 1.244443 0.60746
H  -6.078651 -0.836019 -0.74088
H  5.53285 -0.465659 1.564462
H  4.542621 -1.974946 1.429299
H  6.388955 -1.911439 -0.336977
H  4.759504 -1.921116 -1.073252
H  5.697034 -0.391617 -0.982833
