program: Gaussian 09
title: 000267437
version: EM64L-G09RevD.01
frameworkgroup: C1[X(C12H16N2O3)]
method: RPBEPBE
basis: SDD
operation: Freq
keyword: #p
keyword: freq=noraman
keyword: PBEPBE/SDD
title: #p freq=noraman PBEPBE/SDD
converged: YES YES NO NO
title: Mulliken charges:
elementType: O O O N N C C C C C C C C C C C C H H H H H H H H H H H H H H H H
charge: -0.252323 -0.264566 -0.276129 -0.410162 -0.089806 0.473279 0.117703 -0.454126 0.176078 -0.438605 -0.618423 0.194438 -0.808954 -0.787473 0.296806 -0.267038 -0.659953 0.307791 0.238006 0.384255 0.275101 0.283208 0.235009 0.237143 0.230389 0.253274 0.226319 0.227037 0.238706 0.228824 0.221354 0.231303 0.251536
chargesum: 0.00000
title: Mulliken charges with hydrogens summed into heavy atoms:
elementType: O O O N N C C C C C C C C C C C C
charge: -0.252323 -0.264566 -0.276129 -0.025907 -0.089806 0.473279 0.117703 -0.146335 0.176078 -0.200599 -0.060115 0.194438 -0.106413 -0.080843 0.296806 0.200492 0.044240
polarizability: 2.22219078e+02 1.00912334e+01 1.67892746e+02 7.18066461e+00 -5.16432488e+00 9.43138423e+01
1716.lowfreq: -60.9770 -38.1507 -2.1831 -0.0007 -0.0005 -0.0004 4.9682 10.2265 14.0569
frequency: -60.9373 -38.1425 13.9506 29.3202 58.8691 67.8350 78.4051 90.2013 121.6983 160.2371 178.3810 198.8910 223.7467 242.5382 264.7165 269.5548 299.4120 325.5955 362.2734 422.2291 452.3323 495.8550 515.0801 536.8628 541.3544 573.4065 593.1858 626.0761 681.5310 736.4044 747.0785 800.7761 816.8747 869.6337 883.6223 889.7985 925.2007 928.0291 935.5289 948.9919 967.8044 980.3538 1011.0213 1016.9218 1045.8215 1052.1555 1054.6963 1096.0901 1126.0779 1153.7311 1157.4823 1194.2469 1211.8477 1237.3150 1278.2915 1311.4391 1323.2063 1353.1639 1358.4701 1389.6857 1392.7445 1393.6019 1397.4200 1421.9801 1431.6003 1457.0774 1463.2781 1464.6157 1469.7448 1470.1249 1473.1076 1484.7046 1534.8455 1568.2334 1597.8296 1604.2042 1631.4258 2981.0068 2983.8025 2994.0313 2995.4224 3034.0342 3060.7205 3061.7214 3090.7256 3094.3096 3097.5341 3108.5760 3116.2211 3123.8735 3133.2319 3186.8923 3337.7292
redmass: 1.0179 1.0222 3.9585 3.4019 6.8937 3.0175 4.9377 7.2075 3.0640 3.5256 2.9215 1.6986 3.5831 2.0830 4.9853 2.9014 4.4037 3.6400 7.2015 2.8760 3.1445 4.4644 5.2815 3.8956 3.7669 4.1997 4.2185 4.3101 4.1879 4.5133 3.4786 1.8046 2.1113 1.3043 3.6389 1.3852 3.2745 1.3388 2.5505 2.3630 3.7920 3.0340 2.6875 1.4837 1.5419 1.6153 3.0550 2.1843 2.2418 1.5677 1.6563 1.3695 1.8597 2.0371 1.1216 1.8516 4.4386 3.7766 1.3606 1.3858 1.2387 1.9189 1.5813 1.1541 2.8141 1.0992 1.0446 1.1408 1.0663 1.0525 1.1715 1.0521 2.1535 6.0143 6.0049 7.9982 5.0604 1.0376 1.0381 1.0682 1.0362 1.0597 1.0970 1.0974 1.0974 1.0992 1.1031 1.0910 1.0982 1.1067 1.0925 1.0938 1.0792
irintensity: 0.3572 0.5071 0.8933 0.2362 4.4497 1.5400 1.3875 2.0973 7.4937 8.1323 2.3257 9.3573 0.4626 0.7101 4.0363 0.0478 1.5095 24.4912 5.9278 10.5677 1.0375 21.4783 3.5471 8.6690 10.2701 7.4926 7.5400 1.4479 2.6444 12.0083 4.4091 2.7639 5.6504 19.5989 9.2625 85.5494 12.6296 7.0803 9.8777 24.8165 0.1213 21.4121 57.9108 0.2869 0.1793 22.1032 10.2247 43.5604 276.0991 10.5244 18.9082 33.0464 50.0286 115.4473 6.4452 198.7972 4.0278 1.5910 14.5099 43.0311 23.0501 21.6316 6.5391 87.5590 121.7927 14.0779 14.2006 15.3353 42.7151 11.0406 97.4064 12.9270 637.4667 173.1644 16.3878 173.6037 173.3979 25.8342 23.3217 0.3605 16.0943 30.1099 15.0158 23.7164 32.8430 15.8384 1.1657 0.9323 8.9054 30.8713 13.2496 4.2663 272.7562
temp: 298.150 k
press: 1.00000 atm
elementType: 8 8 8 7 7 6 6 6 6 6 6 6 6 6 6 6 6 1 1 1 1 1 1 1 1 1 1 1 1 1 1 1 1
symmnumber: 1
zpe: 693126.3 jmol-1
zpe.correction: 0.263998 hartree
zpe.thermalcorrener: 0.280577 hartree
zpe.thermalcorrenthalpy: 0.281522 hartree
zpe.thermalcorrgfe: 0.217235 hartree
zpe.sumelectzpe: -800.815174 hartree
zpe.sumelectthermal: -800.798594 hartree
zpe.sumelectthermalent: -800.797650 hartree
zpe.sumelectthermalfe: -800.861937 hartree
dipole: -1.3275 1.4295 0.3273
dipole: 1.9781
quadrupole: -65.9808 -107.1539 -99.6002
quadrupole: -2.1740 1.3192 2.6284
quadrupole: 24.9308 -16.2423 -8.6886 -2.1740 1.3192 2.6284
hfenergy: -801.0791716 hartree
pointgroup: C01 [X(C12H16N2O3)]
dipole: 0.4857484 0.408211 -0.4506376 debye
polarizability: 219.1657522|11.7558189|141.0918924|22.1323787|-33.243002|124.1680212 unknown
InChI: InChI=1S/C12H16N2O3/c1-4-17-12(16)7-11(15)14-10-6-8(2)5-9(3)13-10/h5-6,14H,4,7H2,1-3H3
charge 0 multiplicity 1
33 atoms
O  4.361993 0.451812 0.756395
O  0.495465 -1.862931 1.966096
O  2.415944 1.536934 0.082805
N  0.125909 0.059202 0.659988
N  -1.663732 0.908878 -0.537179
C  -3.365658 -1.256987 0.177676
C  -1.223934 -0.111477 0.259901
C  -2.030281 -1.21153 0.644787
C  -2.952739 0.865451 -0.987053
C  -3.824741 -0.199769 -0.647934
C  2.324211 -0.279848 1.766916
C  0.893029 -0.773621 1.452555
C  -4.276462 -2.413272 0.543652
C  -3.407431 2.013976 -1.865253
C  2.993416 0.658828 0.777845
C  5.168352 1.337678 -0.152036
C  5.226347 0.750029 -1.563559
H  -1.61257 -1.991496 1.283658
H  -4.852879 -0.198418 -1.027526
H  0.580954 0.906703 0.277153
H  2.27442 0.243095 2.744126
H  2.954142 -1.168281 1.924488
H  -4.52046 -3.020663 -0.34854
H  -3.805416 -3.078337 1.286379
H  -5.233712 -2.051591 0.962091
H  -2.574398 2.718183 -2.013255
H  -3.747615 1.652558 -2.853613
H  -4.254058 2.557885 -1.406099
H  4.71432 2.343855 -0.149452
H  6.157218 1.360452 0.332027
H  5.897173 1.365358 -2.191319
H  5.619876 -0.280679 -1.546566
H  4.227816 0.746522 -2.031352
