program: Gaussian 09
title: 000267430
version: EM64L-G09RevD.01
frameworkgroup: C1[X(C21H16O)]
method: RPBEPBE
basis: SDD
operation: Freq
keyword: #pfreq=noraman
keyword: PBEPBE/SDD
title: #p freq=noraman PBEPBE/SDD
converged: YES YES NO NO
title: Mulliken charges:
elementType: O C C C C C C C C C C C C C C C C C C C C C H H H H H H H H H H H H H H H H
charge: -0.174578 -0.021713 -0.689496 -0.073129 0.348814 0.200371 0.390774 0.384344 -0.420476 -0.388471 -0.378829 -0.338930 -0.401313 -0.394252 -0.212765 -0.228725 -0.246674 -0.245156 -0.242142 -0.243809 -0.247347 -0.246030 0.268084 0.245740 0.249228 0.274055 0.250961 0.265821 0.255696 0.236889 0.230855 0.235816 0.225079 0.227067 0.225020 0.223308 0.227673 0.228240
chargesum: 0.00000
title: Mulliken charges with hydrogens summed into heavy atoms:
elementType: O C C C C C C C C C C C C C C C C C C C C C
charge: -0.174578 -0.021713 -0.175671 -0.073129 0.348814 0.200371 0.390774 0.384344 -0.171248 -0.114416 -0.127869 -0.073108 -0.145617 -0.157364 0.018090 0.007092 -0.021595 -0.018089 -0.017122 -0.020501 -0.019674 -0.017790
polarizability: 2.69139535e+02 1.45194993e+00 2.10984624e+02 1.18666160e+01 -1.06440402e+01 1.79963100e+02
1716.lowfreq: -9.5478 -8.0483 -0.0008 -0.0006 0.0004 2.1929 28.2169 32.7336 45.9848
frequency: 28.0753 32.5913 45.9582 70.6528 83.3230 99.0991 143.0063 190.5452 228.0483 236.0535 245.2758 268.7985 293.9255 312.3360 339.7707 400.7979 405.1072 411.1464 466.4302 477.8877 500.8298 528.5850 563.6409 575.3135 614.8481 616.0487 640.0072 648.9137 679.9010 696.7492 703.0618 705.5939 724.4270 760.5582 772.4241 784.4456 804.5697 833.7900 850.2502 856.7566 863.4897 891.3193 921.3646 924.8687 961.9697 977.3248 980.4687 984.9908 989.5479 991.5443 995.3658 996.1768 1002.2426 1004.6084 1016.2578 1023.1125 1033.8062 1045.0006 1087.0589 1090.5529 1099.6434 1143.0776 1168.8045 1172.9942 1173.7783 1186.8156 1191.8775 1198.1016 1200.6439 1208.7730 1234.6231 1273.8226 1294.5451 1323.4682 1327.8834 1372.8160 1379.1412 1397.5696 1431.6826 1435.5323 1449.5280 1456.4610 1470.5775 1482.2524 1484.8048 1586.0042 1590.2820 1595.2272 1605.8952 1610.4238 1611.8219 1631.8671 2999.1405 3055.9621 3119.5279 3123.1782 3125.8315 3128.3535 3132.1740 3139.1158 3141.2077 3145.0043 3150.6155 3153.5360 3156.5147 3165.9770 3166.1553 3169.4888
redmass: 4.4144 4.3628 4.2728 4.5463 4.8952 4.2382 7.8691 5.0941 4.5278 4.1380 6.4760 5.0698 5.3722 4.2954 2.9279 2.8205 2.8447 3.1104 3.4159 3.8256 3.5659 6.7454 5.6996 3.8720 6.3054 6.3378 5.1884 5.7377 4.6214 5.5163 1.7880 1.7265 2.2888 1.8677 2.0503 1.7459 3.6686 2.9528 1.2566 1.2530 4.6704 1.4749 1.4937 1.4304 1.5889 1.4100 1.4203 2.7971 4.9116 4.0497 1.4667 1.3914 1.3423 3.3276 2.3979 3.0900 2.0860 2.5464 1.8385 1.7286 1.8746 1.5499 1.1251 1.0521 1.0517 2.2583 2.5529 1.1544 1.1340 1.6554 2.8366 2.2043 1.5765 1.4128 1.3328 6.0270 7.6533 7.7314 2.2415 2.1951 2.2258 1.7302 1.5646 2.0092 2.2094 5.8151 6.0784 7.0955 6.2264 7.1603 6.0526 10.7521 1.0631 1.0991 1.0853 1.0844 1.0864 1.0878 1.0877 1.0898 1.0935 1.0923 1.0946 1.0957 1.0968 1.1008 1.1006 1.0981
irintensity: 0.4915 0.4632 0.0735 0.3134 1.3547 0.2280 3.2976 0.7689 1.2045 0.8966 2.6386 0.5319 2.2450 0.8370 1.1254 0.0705 0.0340 2.3023 7.1806 0.9894 6.1292 1.8466 5.7737 13.7358 0.8448 0.0678 28.7114 13.3999 2.0344 4.7948 45.3731 58.4072 12.3420 35.6389 35.1649 67.3600 2.9273 1.3099 0.5679 0.4839 32.8651 1.2998 3.5751 0.7992 0.2915 0.2625 1.3192 17.0672 0.8408 5.2588 1.5701 0.7820 0.1874 23.6975 1.8976 7.8242 10.0308 4.3008 21.4327 1.2556 12.2528 0.0881 5.0248 0.0259 0.0428 13.1695 21.0659 3.3359 0.7596 8.1426 38.2591 48.0984 7.0595 2.7315 0.1907 0.2137 0.8287 9.0978 12.5638 4.3247 11.6736 31.3563 8.8894 22.0824 28.9157 2.6291 0.5469 14.9002 22.5349 86.8215 26.6144 108.7024 11.2012 13.0501 3.7607 1.4768 1.4939 2.5970 3.8895 8.3673 30.0125 28.1222 15.3074 28.5541 34.3542 31.6995 18.5597 10.8247
temp: 298.150 k
press: 1.00000 atm
elementType: 8 6 6 6 6 6 6 6 6 6 6 6 6 6 6 6 6 6 6 6 6 6 1 1 1 1 1 1 1 1 1 1 1 1 1 1 1 1
symmnumber: 1
zpe: 791228.9 jmol-1
zpe.correction: 0.301363 hartree
zpe.thermalcorrener: 0.318480 hartree
zpe.thermalcorrenthalpy: 0.319424 hartree
zpe.thermalcorrgfe: 0.255261 hartree
zpe.sumelectzpe: -883.571139 hartree
zpe.sumelectthermal: -883.554021 hartree
zpe.sumelectthermalent: -883.553077 hartree
zpe.sumelectthermalfe: -883.617240 hartree
dipole: -1.7013 -0.1600 -3.0295
dipole: 3.4782
quadrupole: -109.2721 -120.5599 -127.8750
quadrupole: 1.4592 2.4437 -0.8340
quadrupole: 9.9636 -1.3243 -8.6393 1.4592 2.4437 -0.8340
hfenergy: -883.8725017 hartree
pointgroup: C01 [X(C21H16O1)]
dipole: 0.6885674 0.0190039 -1.182432 debye
polarizability: 268.9726033|-5.1531983|210.7239282|-9.4766284|12.7551021|180.3907282 unknown
InChI: InChI=1S/C21H16O/c22-20-19-14-8-7-9-16(19)15-21(20,17-10-3-1-4-11-17)18-12-5-2-6-13-18/h1-14H,15H2
charge 0 multiplicity 1
38 atoms
O  0.300519 0.393487 2.305543
C  -0.262073 0.200697 -0.15208
C  0.656522 0.642598 -1.346992
C  0.675349 0.382761 1.105279
C  2.076922 0.59731 -0.80368
C  2.070794 0.478773 0.608507
C  -1.540861 1.053785 -0.121486
C  -0.567908 -1.320807 -0.146195
C  3.3024 0.705286 -1.491485
C  3.265227 0.477161 1.363016
C  -2.585216 0.764165 -1.039131
C  -1.587617 -1.809356 0.714163
C  -1.675881 2.185588 0.720595
C  0.189331 -2.257104 -0.894423
C  4.505781 0.692077 -0.744545
C  4.490902 0.581538 0.672332
C  -3.730141 1.58495 -1.118481
C  -1.863486 -3.189569 0.797801
C  -2.824008 3.007705 0.644652
C  -0.088312 -3.641296 -0.813744
C  -3.854792 2.713955 -0.275148
C  -1.118226 -4.114227 0.028943
H  0.401976 1.681062 -1.631674
H  0.508301 0.024726 -2.249498
H  3.330469 0.801279 -2.582839
H  3.223441 0.389348 2.453795
H  -2.501624 -0.115997 -1.68766
H  -2.158523 -1.10011 1.322432
H  -0.89838 2.419042 1.453702
H  1.00983 -1.922866 -1.537857
H  5.466548 0.771225 -1.266288
H  5.437048 0.575421 1.224158
H  -4.524378 1.342922 -1.833852
H  -2.656551 -3.543917 1.465766
H  -2.91357 3.874698 1.30906
H  0.505983 -4.347896 -1.404278
H  -4.744464 3.35122 -0.33198
H  -1.331932 -5.187032 0.092976
