program: Gaussian 09
title: 000267429
version: EM64L-G09RevD.01
frameworkgroup: C1[X(C21H14O2)]
method: RPBEPBE
basis: SDD
operation: Freq
keyword: #pfreq=noraman
keyword: PBEPBE/SDD
title: #p freq=noraman PBEPBE/SDD
converged: YES YES NO NO
title: Mulliken charges:
elementType: O O C C C C C C C C C C C C C C C C C C C C C H H H H H H H H H H H H H H
charge: -0.152951 -0.153117 -0.200503 -0.099194 -0.102323 0.437034 0.417002 0.268690 0.268358 -0.378696 -0.378949 -0.347032 -0.338799 -0.393500 -0.398992 -0.209766 -0.210267 -0.239261 -0.244617 -0.236086 -0.236706 -0.243956 -0.243117 0.280755 0.280911 0.258203 0.263252 0.240153 0.248757 0.241892 0.242018 0.226577 0.227344 0.224953 0.225689 0.227884 0.228361
chargesum: 0.00000
title: Mulliken charges with hydrogens summed into heavy atoms:
elementType: O O C C C C C C C C C C C C C C C C C C C C C
charge: -0.152951 -0.153117 -0.200503 -0.099194 -0.102323 0.437034 0.417002 0.268690 0.268358 -0.097941 -0.098038 -0.088829 -0.075547 -0.153347 -0.150235 0.032126 0.031751 -0.012684 -0.017272 -0.011134 -0.011017 -0.016072 -0.014756
polarizability: 2.70418818e+02 -1.87160126e+00 2.10431559e+02 5.87029160e-01 -1.32226750e+01 1.96086993e+02
1716.lowfreq: -6.6353 -0.0006 -0.0005 0.0006 4.1309 8.4337 18.2486 27.5628 38.1292
frequency: 17.5329 27.3674 38.0483 62.4026 87.5182 96.3673 134.0560 154.4149 183.6905 220.2946 235.4434 242.6468 247.4309 296.1626 302.6404 338.4220 398.5321 401.4781 407.6521 446.2696 486.7736 500.1969 523.5268 525.2280 544.2643 614.3770 615.4808 624.6111 665.6270 679.7955 688.5225 699.1011 700.4628 703.6747 757.8533 758.8505 786.1781 803.3727 830.9114 847.0763 852.6454 861.9504 906.9587 911.5744 921.0082 926.6532 974.5928 978.6068 983.6438 986.1997 989.9583 991.8919 995.1351 997.3649 1008.0919 1013.4543 1026.4444 1031.5884 1068.4799 1083.0914 1090.4487 1096.3505 1168.3744 1173.4212 1174.2831 1179.9919 1182.5222 1191.3517 1198.4105 1201.7839 1246.9151 1279.3605 1324.4151 1328.5890 1374.7031 1379.6817 1408.4621 1433.6601 1435.7552 1451.6276 1455.6486 1481.1856 1482.5647 1587.2886 1588.3775 1590.5463 1601.5564 1606.3074 1609.0669 1624.5357 1651.8971 3124.8763 3125.5237 3134.6709 3136.1795 3137.8231 3148.3634 3150.7120 3151.7435 3156.7999 3159.8941 3163.3709 3167.3845 3168.9578 3172.5822
redmass: 5.6046 4.0574 4.0886 4.7585 5.2579 4.5959 8.2570 8.8594 5.3880 4.9218 4.4862 6.3316 7.1398 6.2486 5.0194 9.3104 2.7974 2.8240 3.2377 4.4145 3.5268 3.9229 9.2175 7.6550 6.5064 6.2995 6.4060 6.5268 4.9629 6.4116 4.3993 1.7889 3.5119 2.1435 2.0809 1.9673 1.3953 4.4500 4.5174 1.2545 1.2490 5.5863 3.4308 1.4526 1.7695 1.6146 1.4084 1.4529 2.5496 1.8538 5.8997 4.5313 1.3699 1.4686 2.4765 1.3616 2.5128 2.2082 2.9922 2.3781 1.6715 1.6641 1.3012 1.0522 1.0561 2.5525 2.1686 3.3785 1.1417 1.1401 4.4964 1.6303 1.3555 1.3280 6.7799 8.0490 8.2672 2.2456 2.2366 2.5026 2.5437 2.1454 2.1428 6.7042 6.7067 6.0949 7.6859 5.9335 6.0775 9.9054 12.6284 1.0846 1.0847 1.0883 1.0887 1.0865 1.0926 1.0931 1.0902 1.0958 1.0954 1.0956 1.1011 1.1004 1.1004
irintensity: 3.3125 0.5710 0.0368 0.2706 2.2294 0.3990 0.0724 4.9729 0.1098 1.2941 0.3144 0.4721 2.4914 0.2283 0.3108 7.1833 0.0658 0.0309 1.1334 0.0059 8.8569 3.6291 0.2144 0.5133 13.6820 2.6262 0.7713 57.8244 0.0320 0.1222 8.6070 36.3818 9.3821 48.2680 41.0295 45.1181 79.9002 5.1250 16.6652 0.2479 0.2750 0.4428 0.5468 0.0811 1.1707 1.4666 0.4328 0.1352 2.4850 4.0098 2.7193 1.7224 0.3429 0.1105 2.4036 0.0002 1.9517 16.0254 27.6935 1.2849 5.7697 19.3347 10.6162 0.1563 0.3862 24.9935 3.1845 3.6260 2.0302 2.6291 329.4350 2.4592 3.3832 1.7039 0.4076 0.0513 12.7975 19.2718 2.6544 1.7533 0.9023 36.7652 22.3956 71.2916 67.7062 2.0593 1.2255 10.4742 0.8531 104.5960 64.9345 0.4826 0.1383 7.8902 10.9901 2.0906 27.1401 27.8883 4.6661 21.8351 15.7904 4.1771 16.8356 15.4613 26.1244
temp: 298.150 k
press: 1.00000 atm
elementType: 8 8 6 6 6 6 6 6 6 6 6 6 6 6 6 6 6 6 6 6 6 6 6 1 1 1 1 1 1 1 1 1 1 1 1 1 1
symmnumber: 1
zpe: 741095.9 jmol-1
zpe.correction: 0.282269 hartree
zpe.thermalcorrener: 0.300232 hartree
zpe.thermalcorrenthalpy: 0.301176 hartree
zpe.thermalcorrgfe: 0.234416 hartree
zpe.sumelectzpe: -957.537213 hartree
zpe.sumelectthermal: -957.519249 hartree
zpe.sumelectthermalent: -957.518305 hartree
zpe.sumelectthermalfe: -957.585065 hartree
dipole: 3.1506 0.1292 -0.0252
dipole: 3.1534
quadrupole: -103.9853 -123.5138 -138.1256
quadrupole: -0.7160 -0.0140 -4.4100
quadrupole: 17.8896 -1.6389 -16.2507 -0.7160 -0.0140 -4.4100
hfenergy: -957.8194813 hartree
pointgroup: C01 [X(C21H14O2)]
dipole: -1.2394807 0.0315978 -0.042938 debye
polarizability: 270.1929648|2.3090663|211.5918169|3.3852642|12.6848089|195.1525887 unknown
InChI: InChI=1S/C21H14O2/c22-19-17-13-7-8-14-18(17)20(23)21(19,15-9-3-1-4-10-15)16-11-5-2-6-12-16/h1-14H
charge 0 multiplicity 1
37 atoms
O  -0.515219 -0.08866 2.404588
O  -0.348183 -0.067624 -2.460646
C  0.213707 -0.018654 -0.004777
C  -0.807492 -0.070751 1.183242
C  -0.722454 -0.052763 -1.261564
C  1.138505 -1.251133 0.089504
C  1.013746 1.304617 -0.036857
C  -2.187464 -0.099119 0.619618
C  -2.138462 -0.062533 -0.795303
C  -3.418895 -0.138922 1.306727
C  -3.319021 -0.062273 -1.56748
C  2.168061 -1.251219 1.066004
C  1.990792 1.471094 -1.053769
C  0.952498 -2.404668 -0.712571
C  0.791847 2.36036 0.881444
C  -4.604791 -0.138926 0.538176
C  -4.555501 -0.100069 -0.884406
C  2.99659 -2.380029 1.234137
C  2.728501 2.668821 -1.149329
C  1.786396 -3.53415 -0.545212
C  1.534847 3.560222 0.784818
C  2.8096 -3.527829 0.428313
C  2.503905 3.72059 -0.229389
H  -3.441581 -0.168933 2.400562
H  -3.265197 -0.033734 -2.660257
H  2.311519 -0.366149 1.693987
H  2.161357 0.661078 -1.770294
H  0.176481 -2.425912 -1.484305
H  0.062083 2.251126 1.689403
H  -5.578663 -0.169287 1.038871
H  -5.492292 -0.100709 -1.452232
H  3.786844 -2.364435 1.992977
H  3.478233 2.781483 -1.940447
H  1.636555 -4.416034 -1.178248
H  1.356652 4.365353 1.506576
H  3.454691 -4.404239 0.556874
H  3.078807 4.65061 -0.302235
