program: Gaussian 09
title: 000267420
version: EM64L-G09RevD.01
frameworkgroup: C1[X(C14H15NO4)]
method: RPBEPBE
basis: SDD
operation: Freq
keyword: #p
keyword: freq=noraman
keyword: PBEPBE/SDD
title: #p freq=noraman PBEPBE/SDD
converged: YES YES NO NO
title: Mulliken charges:
elementType: O O O O N C C C C C C C C C C C C C C H H H H H H H H H H H H H H H
charge: -0.410026 -0.212060 -0.208975 -0.210267 0.009787 0.309307 -0.571257 -0.546711 -0.725405 -0.735743 0.175063 0.056037 0.013948 0.320653 0.228319 -0.343736 -0.362739 -0.242812 -0.221211 0.264088 0.216459 0.243715 0.245990 0.223683 0.207581 0.234720 0.227377 0.216562 0.213534 0.373437 0.262823 0.273646 0.235247 0.238964
chargesum: 0.00000
title: Mulliken charges with hydrogens summed into heavy atoms:
elementType: O O O O N C C C C C C C C C C C C C C
charge: -0.036589 -0.212060 -0.208975 -0.210267 0.009787 0.309307 -0.090710 -0.057006 -0.059421 -0.078269 0.175063 0.056037 0.013948 0.320653 0.228319 -0.080912 -0.089093 -0.007565 0.017752
polarizability: 2.19219608e+02 -1.33101043e+01 1.84823699e+02 1.14458157e+01 3.24714298e+00 1.18476637e+02
1716.lowfreq: -14.3626 -9.1229 -5.3558 -0.0008 -0.0007 -0.0006 38.5595 40.2721 61.4585
frequency: 38.1351 40.1515 61.4559 79.3227 88.5103 128.5330 138.8750 145.6055 191.6192 208.4213 223.2832 253.5747 264.6004 267.1587 320.5264 338.8345 342.7913 367.9565 383.0936 394.1141 419.9674 429.6738 448.2475 486.0703 512.2518 546.2166 552.6227 567.0404 605.2626 639.6449 658.3727 680.7417 703.9035 746.8672 778.6780 790.2293 797.8514 877.4123 885.2327 916.5044 924.7577 928.9083 938.2700 960.9058 987.3730 992.3895 996.9013 1011.0267 1040.0096 1070.1938 1121.5540 1138.3197 1139.3338 1162.2067 1172.3559 1176.3979 1219.8314 1227.9789 1237.1349 1258.9923 1280.7864 1286.3531 1298.2480 1323.2125 1348.5666 1368.1463 1378.6159 1380.0651 1397.6306 1428.0519 1431.3642 1440.3562 1463.6000 1468.7625 1476.8673 1480.0966 1488.4200 1567.0763 1573.9021 1608.8971 1657.6411 2943.2212 2967.6658 2969.6260 2977.3977 2995.8193 3060.8032 3062.9029 3070.8070 3073.5524 3079.9681 3141.7672 3160.0127 3179.5070 3185.9266 3577.3002
redmass: 5.0185 4.8317 8.0970 4.3690 5.8683 4.0698 6.4891 5.5299 1.0499 4.0097 1.4556 6.2983 1.8320 4.3213 2.8714 3.0965 3.0671 2.8323 1.4118 4.0356 3.1346 4.4055 3.5287 3.7798 5.1478 4.6590 4.6401 3.7470 3.9760 6.2694 5.1912 4.5751 5.5124 3.3283 1.5568 8.4954 3.3845 1.4336 1.8037 3.3813 1.8221 2.7084 1.4717 1.4047 2.8455 1.3646 2.1278 1.4554 2.9529 2.8790 1.5302 1.8809 1.6072 1.9800 1.4954 1.0825 4.0107 5.2946 2.0357 2.5414 1.5957 1.8328 1.7686 2.9550 2.5766 10.9825 1.2244 5.3850 1.2062 2.4935 1.0902 1.0828 1.0527 1.0575 2.6354 1.0596 1.0595 9.5733 6.7433 6.9370 7.2391 1.0581 1.0498 1.0489 1.0376 1.1004 1.0969 1.0983 1.0993 1.0989 1.0992 1.0868 1.0923 1.0945 1.0982 1.0662
irintensity: 2.8249 3.3347 2.8345 1.0956 1.0644 5.2913 0.2107 1.0790 0.0380 0.9652 1.1981 2.1934 0.2760 3.0764 1.3959 0.4793 6.0274 7.8989 76.0016 3.4750 2.7868 0.9417 8.0559 0.2942 8.0701 2.0870 1.6508 20.3998 21.0283 5.6339 4.0393 19.4462 8.3746 13.8746 45.6515 13.1141 1.8263 0.7431 5.9537 6.4135 7.3448 10.7860 1.6930 3.4949 52.0832 2.7106 15.9147 7.2806 12.6787 4.6360 4.6182 0.9450 0.3475 5.0799 36.5192 3.0569 68.1331 171.5845 109.9524 3.0954 32.6780 3.1867 5.8048 113.2011 153.4397 96.0820 23.2326 17.5032 16.2378 7.7082 6.4001 5.3827 3.9510 9.2800 44.7348 6.8170 12.1708 135.5682 32.4300 16.1209 117.0899 24.9084 18.5293 34.4308 19.8740 16.1670 8.6804 22.9040 23.5344 37.3693 46.0543 3.6632 17.2564 3.6998 8.5535 55.3740
temp: 298.150 k
press: 1.00000 atm
elementType: 8 8 8 8 7 6 6 6 6 6 6 6 6 6 6 6 6 6 6 1 1 1 1 1 1 1 1 1 1 1 1 1 1 1
symmnumber: 1
zpe: 691544.0 jmol-1
zpe.correction: 0.263395 hartree
zpe.thermalcorrener: 0.281195 hartree
zpe.thermalcorrenthalpy: 0.282139 hartree
zpe.thermalcorrgfe: 0.217795 hartree
zpe.sumelectzpe: -896.656860 hartree
zpe.sumelectthermal: -896.639060 hartree
zpe.sumelectthermalent: -896.638116 hartree
zpe.sumelectthermalfe: -896.702460 hartree
dipole: 3.4227 -0.0568 -4.0454
dipole: 5.2994
quadrupole: -92.6848 -116.2781 -114.2090
quadrupole: -15.4328 -1.1331 -0.2974
quadrupole: 15.0392 -8.5542 -6.4850 -15.4328 -1.1331 -0.2974
hfenergy: -896.9202549 hartree
pointgroup: C01 [X(C14H15N1O4)]
dipole: -1.4019151 0.9600582 1.2082656 debye
polarizability: 219.5504734|18.211995|157.3185478|4.9638683|-31.7238725|145.6509223 unknown
InChI: InChI=1S/C14H15NO4/c1-14(2)7-11(16)13(12(17)8-14)9-5-3-4-6-10(9)15(18)19/h3-6,16H,7-8H2,1-2H3
charge 0 multiplicity 1
34 atoms
O  -0.246469 -0.328198 2.187211
O  -0.659102 0.880243 -2.422856
O  2.588921 -2.260926 1.648161
O  0.835659 -2.36441 0.20283
N  1.818104 -1.734922 0.754041
C  -3.339013 0.134615 0.019373
C  -2.472502 -0.540478 1.121741
C  -2.615951 -0.080152 -1.337141
C  -3.50202 1.649408 0.312144
C  -4.73384 -0.535021 -0.015773
C  -1.00698 -0.185939 1.027733
C  -1.160589 0.398066 -1.360327
C  -0.363684 0.225402 -0.119683
C  1.095327 0.53146 -0.145259
C  2.116411 -0.347745 0.316795
C  1.523556 1.796333 -0.627575
C  3.480166 0.020449 0.346392
C  2.883778 2.170173 -0.630736
C  3.868211 1.285418 -0.133016
H  -2.562006 -1.644982 1.036591
H  -2.863979 -0.261811 2.123487
H  -3.150102 0.431182 -2.157745
H  -2.606092 -1.164145 -1.578835
H  -4.087716 2.133977 -0.490155
H  -4.038188 1.809254 1.266441
H  -2.527054 2.1649 0.375676
H  -5.371071 -0.067108 -0.788392
H  -4.658511 -1.614451 -0.24638
H  -5.251974 -0.427109 0.956334
H  -0.792992 -0.639325 2.951236
H  0.768404 2.489615 -1.005496
H  4.210692 -0.69485 0.733705
H  3.17275 3.153132 -1.01744
H  4.924458 1.572548 -0.125782
