program: Gaussian 09
title: 000267415
version: EM64L-G09RevD.01
frameworkgroup: C1[X(C9H4Br2O2)]
method: RPBEPBE
basis: SDD
operation: Freq
keyword: #p
keyword: freq=noraman
keyword: PBEPBE/SDD
title: #p freq=noraman PBEPBE/SDD
converged: YES YES NO YES
title: Mulliken charges:
elementType: Br Br O O C C C C C C C C C H H H H
charge: 0.143458 0.143562 -0.123459 -0.123459 0.244485 0.244485 -0.797250 0.149318 0.149317 -0.345568 -0.345568 -0.200862 -0.200862 0.283485 0.283484 0.247717 0.247717
chargesum: 0.00000
title: Mulliken charges with hydrogens summed into heavy atoms:
elementType: Br Br O O C C C C C C C C C
charge: 0.143458 0.143562 -0.123459 -0.123459 0.244485 0.244485 -0.797250 0.149318 0.149317 -0.062083 -0.062084 0.046855 0.046855
polarizability: 1.84505241e+02 -1.71842335e-02 9.99266278e+01 2.44339430e-05 7.41133593e-02 1.26197085e+02
1716.lowfreq: -4.7118 -0.0005 -0.0004 -0.0002 7.1195 10.2341 19.0064 98.7517 125.8625
frequency: 18.9695 98.7498 125.8614 129.7312 144.1191 163.4319 188.1105 234.5212 239.2230 334.3722 406.9383 439.8949 516.8526 519.3750 537.2545 620.6160 653.9623 680.1882 741.7607 762.3339 793.4937 815.2966 835.5115 912.2151 961.5825 988.2139 1006.3964 1015.5121 1051.1885 1082.8908 1173.5898 1183.0835 1237.0081 1282.2361 1409.6286 1452.7575 1455.0988 1593.6363 1596.7378 1639.3825 1664.8076 3143.3421 3156.8751 3168.5830 3177.2256
redmass: 12.1629 6.3508 8.7227 25.2586 13.9978 10.9255 6.8740 29.4215 7.6100 10.6606 3.2992 4.4688 7.6437 11.7592 8.8035 8.9287 5.0309 8.1381 2.0329 7.1248 4.6020 2.3452 7.9591 1.4406 10.2936 1.4092 2.8338 1.3696 3.8031 2.5101 1.1172 1.9913 4.0698 1.5983 8.0031 2.5042 2.5460 7.0295 7.6138 11.8011 13.0055 1.0869 1.0906 1.0958 1.1005
irintensity: 2.1379 0.0000 0.0000 0.0133 2.2124 0.3024 0.5648 0.0234 0.1795 7.1401 0.0085 0.0000 0.4067 2.0680 136.0785 58.7106 0.0001 0.1801 1.7653 37.5335 0.0000 108.9202 0.1618 0.0000 7.1868 5.0702 2.7239 0.0000 12.8395 0.2545 23.2552 2.5863 221.2787 2.3185 7.9600 2.5884 0.3411 104.4355 0.2789 227.4905 39.3833 1.7764 3.1920 2.0205 19.4480
temp: 298.150 k
press: 1.00000 atm
elementType: 35 35 8 8 6 6 6 6 6 6 6 6 6 1 1 1 1
symmnumber: 1
zpe: 271268.5 jmol-1
zpe.correction: 0.103321 hartree
zpe.thermalcorrener: 0.114762 hartree
zpe.thermalcorrenthalpy: 0.115707 hartree
zpe.thermalcorrgfe: 0.062923 hartree
zpe.sumelectzpe: -521.814849 hartree
zpe.sumelectthermal: -521.803407 hartree
zpe.sumelectthermalent: -521.802463 hartree
zpe.sumelectthermalfe: -521.855246 hartree
dipole: -6.1262 0.0000 0.0000
dipole: 6.1262
quadrupole: -69.5383 -91.6261 -100.8933
quadrupole: 0.0009 0.0000 -0.0231
quadrupole: 17.8142 -4.2736 -13.5407 0.0009 0.0000 -0.0231
hfenergy: -521.9181694 hartree
pointgroup: C01 [X(C9H4Br2O2)]
dipole: 2.4102383 0.0000772 -0.0001504 debye
dipolederiv: -0.2551216 -0.0001575 -0.3136627 -0.0001707 -0.0322007 -0.0001871 -0.22914 -0.000153 -0.5485595 -0.2558472 0.0001433 0.314378 0.0001562 -0.0320154 -0.0001664 0.2297772 -0.0001378 -0.5473706 -0.5256598 0.169025 -0.0000473 0.1555402 -0.8865008 -0.000304 0.0000283 -0.0003384 -0.2535228 -0.5256386 -0.1690022 0.0000706 -0.1555172 -0.8865216 0.0005919 -0.000048 -0.0000491 -0.2535228 -0.6065538 0.2656464 -0.0000673 0.3554152 -0.1341824 -0.0000824 0.0001399 0.0000171 0.0593121 -0.6065118 -0.2656775 -0.0000417 -0.3554458 -0.1342227 0.0000308 -0.0000269 0.0000813 0.0593115 0.1872428 0.0000162 -0.00134 0.000016 -0.3109802 0.0002673 -0.0015078 0.0002709 1.3155651 1.2626822 -0.3141768 0.0005084 0.1281055 1.0813692 0.0006508 0.0004224 0.0005063 -0.0272057 1.2626699 0.3141888 0.0002173 -0.1280931 1.0813815 -0.0008387 0.0003389 -0.0002733 -0.0272046 -0.1272648 -0.1255799 0.000064 0.1489923 0.1321621 -0.000018 -0.0000054 -0.0000314 -0.0810171 -0.1272642 0.1255633 -0.0000109 -0.1490102 0.1321614 -0.0000316 0.0000248 0.0000221 -0.0810171 0.1146918 0.1288689 -0.0000774 0.1738321 -0.0564233 0.0000367 -0.0000273 -0.0000142 -0.1211205 0.1147114 -0.1288579 -0.0000645 -0.1738204 -0.0564431 -0.0000095 -0.0000542 0.0000237 -0.1211204 0.1019352 0.0204457 0.0000099 -0.026663 -0.0061721 0.0000257 -0.0000484 0.0000547 0.160976 0.1019346 -0.0204383 0.0000169 0.0266703 -0.0061723 0.0000202 0.0000501 0.0000475 0.1609759 -0.0579983 -0.0698638 0.0000272 -0.073704 0.0573756 0.0000163 0.000057 0.0000124 0.1527602 -0.0580078 0.0698563 0.0000194 0.0736965 0.0573848 -0.000002 0.0000195 -0.0000389 0.1527601 unknown
polarizability: 184.5052383|0.0018856|126.197286|-0.0224642|0.0148571|99.9264296 unknown
InChI: InChI=1S/C9H4Br2O2/c10-9(11)7(12)5-3-1-2-4-6(5)8(9)13/h1-4H
charge 0 multiplicity 1
17 atoms
Br -2.84076 -0.000629 -1.657209
Br -2.843701 0.000424 1.654888
O  -1.118331 2.44515 0.000888
O  -1.118175 -2.445242 0.00062
C  0.622451 0.710342 0.000159
C  0.622497 -0.710322 0.000341
C  -1.71102 -0.000066 -0.00001
C  -0.767565 1.245646 0.00012
C  -0.767485 -1.245716 0.000926
C  1.829331 1.439882 -0.000034
C  1.829424 -1.439783 0.000181
C  3.040585 0.712082 -0.000158
C  3.040631 -0.711904 -0.000073
H  1.814144 2.533975 -0.000165
H  1.81431 -2.533878 0.000337
H  3.99614 1.247087 -0.000346
H  3.996221 -1.246847 -0.000167
