program: Gaussian 09
title: 000267387
version: EM64L-G09RevD.01
frameworkgroup: C1[X(C6H6N4O3)]
method: RPBEPBE
basis: SDD
operation: Freq
keyword: #pfreq=noraman
keyword: PBEPBE/SDD
title: #p freq=noraman PBEPBE/SDD
converged: NO NO NO NO
title: Mulliken charges:
elementType: O O O N N N N C C C C C C H H H H H H
charge: -0.232659 -0.239547 -0.179108 -0.424029 -0.394761 0.021450 -0.325668 0.431512 -0.387702 0.138922 0.186427 -0.309351 -0.001956 0.388886 0.256855 0.366402 0.232484 0.302580 0.169262
chargesum: 0.00000
title: Mulliken charges with hydrogens summed into heavy atoms:
elementType: O O O N N N N C C C C C C
charge: -0.232659 -0.239547 -0.179108 -0.035143 -0.028358 0.021450 -0.023088 0.431512 -0.130846 0.138922 0.186427 -0.076866 0.167305
polarizability: 2.13175254e+02 1.87324349e+01 1.19623288e+02 1.90446251e-02 -1.09833536e-03 4.12984573e+01
1716.lowfreq: -0.0001 0.0006 0.0009 3.9978 5.6392 9.1316 49.3258 65.1784 97.5596
frequency: 49.3031 65.1772 97.5445 165.2022 174.2177 189.7875 217.9175 273.1038 300.3666 370.7170 385.8330 396.1783 504.3967 526.6337 579.1007 622.2158 654.0137 675.1669 699.9452 705.4931 759.0161 786.9933 799.0343 823.7571 909.3803 936.3108 958.1111 971.0521 997.2455 1034.7895 1146.4073 1189.0657 1212.8824 1314.7750 1320.2803 1344.8102 1367.7287 1384.3604 1482.5684 1505.3730 1556.6721 1606.3300 1645.0728 1662.9066 1678.9369 2943.5977 3040.5943 3204.9855 3370.8878 3496.1620 3528.8337
redmass: 9.8359 9.1287 4.9639 7.9463 4.9544 10.2804 4.0084 3.0984 7.9722 9.5674 3.5196 8.6746 8.5424 6.2211 6.5089 2.7838 1.3174 2.8546 2.2077 6.2134 1.5423 1.5097 7.4375 1.6719 1.5631 4.3990 1.5969 3.5850 4.1938 3.1527 3.0096 2.6319 3.0136 1.7818 1.4993 2.4788 1.9133 1.2017 2.5763 2.1491 8.5700 6.3911 6.4137 5.8675 5.8220 1.0874 1.0905 1.0939 1.0766 1.0780 1.0772
irintensity: 8.7163 6.3549 7.6553 10.1532 1.5154 3.2997 23.1887 11.5359 10.6664 17.7219 0.1952 0.9211 11.8743 5.8921 5.9324 11.1206 69.5835 1.7681 51.2377 2.0778 13.1357 141.4076 35.3292 85.4923 58.5804 1.0376 2.9491 5.4787 11.6190 31.1215 271.8780 115.8626 38.4541 40.0665 5.3024 88.3487 81.0281 30.4631 127.2958 161.4218 74.8368 51.1730 479.3602 122.0461 828.0226 104.1884 27.3477 1.3070 1.0536 93.1732 70.2680
temp: 298.150 k
press: 1.00000 atm
elementType: 8 8 8 7 7 7 7 6 6 6 6 6 6 1 1 1 1 1 1
symmnumber: 1
zpe: 344711.3 jmol-1
zpe.correction: 0.131294 hartree
zpe.thermalcorrener: 0.142612 hartree
zpe.thermalcorrenthalpy: 0.143556 hartree
zpe.thermalcorrgfe: 0.093013 hartree
zpe.sumelectzpe: -675.979384 hartree
zpe.sumelectthermal: -675.968066 hartree
zpe.sumelectthermalent: -675.967121 hartree
zpe.sumelectthermalfe: -676.017665 hartree
dipole: 4.8336 -6.1819 0.0009
dipole: 7.8473
quadrupole: -82.6491 -81.3231 -75.1614
quadrupole: -23.7557 0.0058 -0.0013
quadrupole: -2.9379 -1.6120 4.5498 -23.7557 0.0058 -0.0013
hfenergy: -676.1106775 hartree
pointgroup: C01 [X(C6H6N4O3)]
dipole: 1.9295014 -2.4101549 0.0003566 debye
dipolederiv: -0.4874533 0.0891663 -0.0000003 0.2811265 -1.3374858 -0.0000781 0.0000049 -0.0000881 -0.3849507 -1.2581317 -0.429492 -0.0002031 -0.1912146 -0.6738895 -0.0001052 0.0001694 0.0001304 -0.3694351 -0.5207843 -0.021573 0.000004 -0.851688 -0.961899 -0.0003475 0.0007117 0.0006432 -0.3165962 -0.8236647 0.579965 0.0000012 0.1385547 -1.107857 -0.0000468 0.0000197 -0.0000232 -0.2903306 -0.5363025 -0.3454303 -0.0000497 -0.0902744 -1.1541911 0.0000154 -0.0000411 -0.0001692 -0.3584974 0.9926561 0.1712175 0.0002357 -0.5096243 -0.3486933 -0.0000608 0.0004731 0.0000439 -0.0770269 -1.9206816 -0.6238488 -0.0000175 -0.0263139 -0.1708724 0.0001253 -0.0001092 -0.0002059 -0.3228407 0.5225545 0.0645395 0.0000722 0.0623024 0.8794434 0.0000567 -0.0000075 0.0000496 0.1126529 -1.0452953 -0.2158801 -0.0000747 0.2616789 -0.1587073 -0.000011 -0.0000348 0.0000161 -0.2307101 1.1493075 -0.2552418 0.0000337 -0.3515147 1.9372402 0.000152 0.0000408 0.0001512 0.3374966 1.8311805 0.4059756 0.0002231 -0.1945473 1.2221261 0.0000635 0.0000058 0.0000065 0.2715282 -0.0598541 0.0403953 -0.0000008 -0.2344659 0.3015538 -0.0000824 -0.0003889 -0.0001103 -0.0979593 1.7121888 0.4170264 -0.0000901 1.3169647 1.3842224 0.0003365 -0.0010409 -0.0002734 0.1727725 0.2855163 -0.0131259 0.0000035 0.0185138 0.2251362 -0.0000173 0.0000025 -0.0000297 0.3304399 0.0818166 0.0363333 -0.0000189 0.0690402 0.0085441 0.0000084 -0.0000135 0.0000164 0.1888517 0.2396102 -0.0253148 -0.0000068 -0.0412599 0.155736 -0.0000365 -0.0000072 -0.0000379 0.346372 -0.0030649 0.0375227 -0.0000397 0.0791168 -0.1169348 0.0000124 -0.0000333 0.0000632 0.2030332 -0.0097841 -0.0045065 -0.0000917 0.0311208 0.0026683 0.0000273 -0.0002821 -0.0000366 0.3557626 -0.1498142 0.0922716 0.0000198 0.2324842 -0.0861402 -0.0000119 0.0005307 -0.000146 0.1294372 unknown
polarizability: 212.7326839|19.8018079|120.0658587|0.019056|-0.0008795|41.2984573 unknown
InChI: InChI=1S/C6H6N4O3/c11-3-8-7-2-4-1-5(12)10-6(13)9-4/h1-3,8-10H
charge 0 multiplicity 1
19 atoms
O  -1.749613 2.708639 0.000093
O  -3.923499 -1.446875 -0.000137
O  4.362902 1.251313 -0.000121
N  -0.456507 0.752395 -0.000085
N  -2.80211 0.60695 -0.000209
N  2.007475 -0.363181 0.000274
N  3.286442 -0.858091 0.000695
C  -0.359059 -0.635861 -0.00015
C  -1.493086 -1.430022 -0.000245
C  -1.677587 1.453041 -0.000036
C  -2.823449 -0.821906 -0.00052
C  0.991461 -1.201131 -0.000027
C  4.402122 0.004581 0.001029
H  0.411067 1.301582 0.000014
H  -1.428762 -2.518852 -0.000181
H  -3.713513 1.075905 -0.000131
H  1.08293 -2.301092 0.000072
H  3.464827 -1.875636 0.000721
H  5.34076 -0.596057 0.000143
