program: Gaussian 09
title: 000267373
version: EM64L-G09RevD.01
frameworkgroup: C1[X(C10H8O2)]
method: RPBEPBE
basis: SDD
operation: Freq
keyword: #pfreq=noraman
keyword: PBEPBE/SDD
title: #p freq=noraman PBEPBE/SDD
converged: NO NO NO NO
title: Mulliken charges:
elementType: O O C C C C C C C C C C H H H H H H H H
charge: -0.219565 -0.204374 0.277866 0.361982 -0.416671 -0.479561 -0.352113 -0.377835 0.170268 -0.228840 -0.234208 -0.230859 0.245177 0.245172 0.270256 0.231533 0.235636 0.234931 0.233675 0.237530
chargesum: 0.00000
title: Mulliken charges with hydrogens summed into heavy atoms:
elementType: O O C C C C C C C C C C
charge: -0.219565 -0.204374 0.277866 0.361982 0.073677 -0.209305 -0.120581 -0.142199 0.170268 0.006091 -0.000533 0.006670
polarizability: 1.90849406e+02 1.39626036e+01 1.13521253e+02 6.83548289e-03 7.23469597e-03 4.81639110e+01
1716.lowfreq: -7.4793 -0.0005 0.0007 0.0008 5.5989 22.2715 45.3431 91.8639 134.1497
frequency: 45.0451 91.6321 134.1467 189.5576 231.0060 308.2875 368.4543 398.1152 414.0998 510.1730 548.4137 613.3010 644.6900 665.5870 666.8972 694.6923 773.6397 806.8319 845.5284 848.9285 875.6548 925.5074 953.5301 980.5710 988.8319 991.6571 1003.5270 1003.7673 1029.8614 1086.3234 1099.1620 1148.9171 1177.6741 1197.2031 1232.8049 1282.5605 1307.5819 1337.8363 1381.3008 1439.6034 1449.5212 1487.0104 1580.4113 1609.9778 1622.5756 1707.9292 3002.5859 3058.4595 3127.3302 3132.7671 3144.0752 3154.5889 3169.0452 3210.1142
redmass: 4.0790 5.5789 5.3015 4.9662 2.9424 7.4662 6.0615 2.7610 3.0635 5.2742 2.5061 6.5253 7.9724 7.1409 4.3800 1.8124 1.8153 6.5053 1.2810 5.6355 1.5122 1.4216 5.9263 1.3962 6.1633 1.7783 1.3539 5.1152 2.0228 1.6052 3.6270 1.0713 1.0584 1.1261 1.6575 1.8869 1.6913 1.6614 7.8022 2.2886 1.1050 2.2620 5.6522 6.0144 7.5504 12.3063 1.0571 1.1061 1.0859 1.0872 1.0919 1.0965 1.1017 1.0979
irintensity: 0.4483 1.6098 2.9342 0.5163 11.1473 0.0652 3.5479 0.3138 10.1763 1.8220 2.0435 0.0977 4.5101 0.8585 4.5422 38.5546 80.1186 63.3496 0.8522 1.4875 29.3130 1.3324 18.7537 0.0778 4.2850 2.1591 0.2749 17.3544 14.8813 6.5136 108.7956 0.5219 0.0906 2.1908 1.6173 17.8989 0.1574 11.1242 1.6421 16.2028 9.2494 12.5110 9.6621 0.0115 87.0617 552.8829 19.9135 9.6804 5.1468 0.1831 10.5367 30.3825 18.3852 3.3580
temp: 298.150 k
press: 1.00000 atm
elementType: 8 8 6 6 6 6 6 6 6 6 6 6 1 1 1 1 1 1 1 1
symmnumber: 1
zpe: 398950.4 jmol-1
zpe.correction: 0.151952 hartree
zpe.thermalcorrener: 0.161427 hartree
zpe.thermalcorrenthalpy: 0.162371 hartree
zpe.thermalcorrgfe: 0.116291 hartree
zpe.sumelectzpe: -535.464864 hartree
zpe.sumelectthermal: -535.455389 hartree
zpe.sumelectthermalent: -535.454445 hartree
zpe.sumelectthermalfe: -535.500525 hartree
dipole: 6.9921 0.8307 0.0007
dipole: 7.0413
quadrupole: -88.0037 -60.6776 -72.0279
quadrupole: -2.3952 -0.0028 0.0003
quadrupole: -14.4340 12.8921 1.5419 -2.3952 -0.0028 0.0003
hfenergy: -535.616816 hartree
pointgroup: C01 [X(C10H8O2)]
dipole: -2.7530878 -0.3079538 0.0002943 debye
dipolederiv: -0.6542783 -0.0585622 0.0000211 -0.055414 -0.88243 0.0001855 0. 0.0000397 -0.2917787 -1.3474117 -0.4067292 0.0000488 -0.2804118 -0.6099257 0.0000345 0.0002744 0.0001689 -0.3323882 0.8218569 -0.0029936 -0.0000269 0.193746 0.2200642 -0.0000631 -0.0000726 -0.0000332 -0.048724 -0.1765203 0.0474747 -0.0000136 0.093243 -0.0194713 0.0000116 -0.0000705 -0.0000126 0.0302153 0.2832553 0.1651713 -0.0000366 0.0253569 0.0308228 0.0000279 0.0000002 0.0000142 0.3357283 -1.1080107 -0.0937483 0.0000741 -0.1129286 -0.0561409 -0.0000477 0.0000087 -0.0000134 -0.1654262 -0.0347676 0.0866725 0.0000108 -0.0436383 0.0231249 0.0000099 0.0000321 -0.0000013 -0.1301179 0.0460729 -0.0794255 0.0000015 0.0187728 0.0227769 -0.0000067 -0.0000062 0.0000012 -0.1577877 2.1126148 0.4276915 -0.0000873 0.1285099 1.1701046 -0.0001986 -0.000125 -0.0002216 0.2562472 -0.0911664 -0.1136846 0.0000022 -0.1763961 0.0936871 0.0000009 -0.0000007 -0.000002 -0.1407372 -0.0925747 0.124636 -0.0000009 0.2422917 0.0696724 -0.0000092 -0.0000019 -0.0000024 -0.1402532 0.071577 -0.0115403 0.0000026 -0.0293705 -0.0248383 -0.0000042 0. -0.0000012 -0.1465431 0.027002 -0.0652192 0.0348519 -0.0528135 0.030218 0.0626881 0.0559759 0.0924236 -0.0120295 0.0269934 -0.0652454 -0.0348316 -0.0528326 0.0301703 -0.062687 -0.0559602 -0.0924165 -0.0119456 0.0931855 0.0508049 -0.000015 0.0793614 -0.0067972 0.0000452 -0.0000542 0.0000423 0.1864158 0.0379603 -0.1050859 -0.0000021 -0.0689321 -0.0186366 -0.000001 -0.0000044 0.0000057 0.1440369 0.0593922 0.1011856 -0.0000022 0.0879684 -0.0497353 0.0000035 0.0000037 0.0000002 0.1454222 0.0304158 0.0715225 -0.0000008 0.0992786 -0.0660578 0.0000034 -0.0000054 0.0000018 0.1587781 0.0109989 -0.0833503 0.0000034 -0.1082004 -0.0505751 0.000006 0.0000032 0.0000053 0.1593798 -0.1165955 0.0104255 0.0000006 0.0124093 0.0939668 0.0000009 0.000003 0.0000016 0.1615079 unknown
polarizability: 191.0374211|13.4305664|113.3332387|-0.006885|-0.0071876|48.163911 unknown
InChI: InChI=1S/C10H8O2/c11-10-6-9(7-12-10)8-4-2-1-3-5-8/h1-6H,7H2
charge 0 multiplicity 1
20 atoms
O  2.838648 -1.100317 0.000108
O  4.081114 0.892739 -0.000444
C  0.662333 -0.092724 0.000033
C  -0.806346 0.001641 0.00004
C  1.401214 -1.42852 0.000246
C  1.600074 0.904211 -0.00023
C  -1.464907 1.265699 0.000012
C  -1.604115 -1.178767 0.000077
C  2.972275 0.337233 -0.000008
C  -2.871073 1.344425 0.00001
C  -3.012579 -1.099316 0.000075
C  -3.652225 0.162218 0.000039
H  1.188223 -2.031342 0.902214
H  1.188136 -2.031679 -0.901477
H  1.442942 1.983001 -0.00052
H  -0.873287 2.18771 0.000002
H  -1.1257 -2.165194 0.000096
H  -3.361164 2.324165 -0.000011
H  -3.610865 -2.016982 0.000098
H  -4.745998 0.224599 0.000039
