program: Gaussian 09
title: 000267369
version: EM64L-G09RevD.01
frameworkgroup: C1[X(C8H10N2O3)]
method: RPBEPBE
basis: SDD
operation: Freq
keyword: #p
keyword: freq=noraman
keyword: PBEPBE/SDD
title: #p freq=noraman PBEPBE/SDD
converged: YES YES NO NO
title: Mulliken charges:
elementType: O O O N N C C C C C C C C H H H H H H H H H H
charge: -0.276325 -0.266435 -0.247313 -0.191255 -0.395649 -0.015316 -0.453969 -0.461774 -0.308724 0.204715 -0.075121 -0.302985 0.148945 0.289215 0.233232 0.278680 0.235738 0.248495 0.228076 0.226807 0.287273 0.358866 0.254824
chargesum: 0.00000
title: Mulliken charges with hydrogens summed into heavy atoms:
elementType: O O O N N C C C C C C C C
charge: -0.276325 -0.266435 -0.247313 -0.191255 -0.036783 0.273898 0.057943 0.022459 0.146159 0.204715 0.212152 -0.048161 0.148945
polarizability: 1.43503445e+02 -8.43496126e+00 1.08520866e+02 6.55853072e+00 -1.57472812e+00 6.55461717e+01
1716.lowfreq: -13.5306 -9.1572 -0.0004 -0.0004 0.0008 3.1301 42.2310 59.3775 92.9487
frequency: 42.1232 59.2959 92.9000 155.2839 172.6128 209.9071 234.9702 289.4629 372.6072 385.1253 422.3925 501.5845 519.4791 593.3465 596.0034 685.0115 692.8306 701.4945 744.4508 753.6669 770.4849 808.4913 829.8142 875.4922 886.9691 920.1238 939.7591 941.7294 967.5777 1028.4764 1037.5259 1054.3871 1095.2646 1130.3559 1152.4401 1166.8145 1200.8335 1216.5670 1244.5723 1266.1596 1303.3363 1316.9869 1328.0109 1338.2124 1346.7630 1361.9599 1418.8373 1465.1481 1471.6461 1490.8455 1593.0324 1635.2817 1663.5286 3010.7525 3022.5956 3030.1841 3076.1648 3078.9224 3097.9965 3122.1962 3187.5154 3215.8518 3522.9355
redmass: 3.5173 5.0899 3.5704 3.1825 8.3721 4.6552 3.0994 8.0877 6.3265 4.6568 3.3947 4.2523 6.8121 6.0908 2.2654 2.9237 4.1968 2.3062 4.6050 4.6164 2.1455 1.8759 2.9613 2.1856 1.6635 2.5612 2.3718 3.1178 1.3034 3.8858 2.6535 1.7906 1.7169 1.9785 1.3316 1.9476 2.7209 1.3625 1.3962 1.7337 1.4208 1.2691 2.1417 1.3547 1.3977 1.8424 2.9454 1.0856 1.0922 1.0931 5.8523 10.2380 6.1630 1.0589 1.0650 1.0656 1.0937 1.1006 1.1045 1.1007 1.0892 1.0981 1.0770
irintensity: 2.5712 1.2513 1.5553 0.9320 5.4986 10.5817 1.8947 6.7245 8.2641 6.8935 11.3927 16.0533 11.0455 3.1189 6.6355 21.2190 1.5526 13.2650 15.3320 1.8767 58.0405 100.4103 20.5822 5.1663 3.4736 15.6395 22.2386 3.3245 2.3655 127.0094 52.9695 8.0186 12.1782 11.9023 26.8046 26.9955 38.2131 22.9749 87.1783 72.2169 8.3718 7.2776 86.4861 2.7640 9.9976 19.6103 88.8974 14.3935 15.0875 3.8513 21.1617 296.4015 743.8761 63.3226 15.8817 15.6423 22.7506 2.9746 39.2964 16.6678 4.6303 0.2206 53.8967
temp: 298.150 k
press: 1.00000 atm
elementType: 8 8 8 7 7 6 6 6 6 6 6 6 6 1 1 1 1 1 1 1 1 1 1
symmnumber: 1
zpe: 471670.1 jmol-1
zpe.correction: 0.179650 hartree
zpe.thermalcorrener: 0.190732 hartree
zpe.thermalcorrenthalpy: 0.191677 hartree
zpe.thermalcorrgfe: 0.141773 hartree
zpe.sumelectzpe: -645.075743 hartree
zpe.sumelectthermal: -645.064660 hartree
zpe.sumelectthermalent: -645.063716 hartree
zpe.sumelectthermalfe: -645.113619 hartree
dipole: -5.7400 -1.3454 1.2046
dipole: 6.0174
quadrupole: -84.1849 -78.3015 -77.4958
quadrupole: 5.1418 -6.6475 0.1173
quadrupole: -4.1908 1.6925 2.4983 5.1418 -6.6475 0.1173
hfenergy: -645.2553924 hartree
pointgroup: C01 [X(C8H10N2O3)]
dipole: -2.3048729 -0.485027 0.238701 debye
dipolederiv: -0.9456553 -0.1429371 0.0226807 -0.3455326 -0.4958571 -0.0271147 0.0105267 -0.0285706 -0.4650266 -0.6206782 0.141011 -0.0266414 0.2219608 -1.2458367 0.0217154 -0.0159479 -0.0150783 -0.3753343 -1.3280277 0.2703682 -0.2181714 0.0861964 -0.5047044 0.0095353 -0.2795233 0.0685169 -0.4364628 -0.9497687 -0.2679883 -0.1523078 0.6198728 -1.1878989 0.0433969 -0.0822806 -0.190508 -0.2275905 -0.8765893 0.4182491 -0.0858157 0.4829457 -0.7999577 0.0962639 -0.1162461 0.0871629 -0.3642225 1.3884151 0.0182891 0.1112599 0.118995 0.4305415 -0.0168426 0.3596145 0.0628498 0.4617689 -0.0372085 -0.0421564 0.0474428 -0.0136183 0.0282923 -0.0267115 0.0206531 -0.1003844 -0.0820453 0.0308308 -0.0818501 0.0413587 -0.0488472 -0.0534127 -0.0778271 0.0547336 -0.0062273 -0.0372095 0.686351 0.1272063 -0.0407116 0.0971856 0.3356969 -0.0349872 -0.2701139 -0.1097177 0.2676766 1.1396185 0.0048483 0.1863483 -0.1886514 1.7104515 -0.0007162 0.1824062 0.0981518 0.3443055 0.5691938 -0.2663543 0.1198235 -0.858141 0.6697278 -0.0978884 0.1020126 0.0028381 0.020387 -0.8709111 0.1040556 -0.1203014 -0.2095073 -0.1316227 -0.0414679 -0.2144764 0.0532931 -0.2922984 1.6719853 -0.3645965 0.3416557 -0.0987506 0.9816746 0.0249303 0.4271329 -0.0483369 0.3712881 -0.0710113 -0.0310714 0.0165822 0.0188329 -0.0024663 0.0646583 0.018692 0.0580808 -0.00723 -0.077726 0.1065948 -0.0316637 0.0809912 -0.0052096 0.056344 -0.0220952 0.0713311 0.0524589 0.0907027 -0.0747825 -0.0805845 -0.0500991 0.0433943 -0.0467206 -0.095 -0.0302497 0.028035 0.0037657 0.0667952 -0.11334 0.0616075 -0.0083807 0.0532027 -0.0929319 0.0382447 0.0044703 -0.0740792 0.0161031 0.1162073 0.0236259 0.1072609 -0.0114924 0.1058786 -0.0083595 0.0147777 0.0554003 0.0312461 0.0180186 -0.0599234 -0.15612 0.0090393 0.0328028 0.0193182 0.0668462 -0.1998823 -0.00902 -0.0603145 0.0686501 0.0596159 0.0349199 -0.0361038 0.0193739 0.0107227 0.1413143 -0.0841717 -0.0278098 -0.0711025 0.0625729 -0.0082506 -0.0128552 -0.023699 0.1433871 0.1978184 0.0318969 -0.0373605 0.0576462 0.1647954 -0.0019546 -0.0385677 -0.003362 0.3224898 0.0761418 0.0282648 -0.0263555 0.0056633 -0.002557 -0.0220323 -0.0383107 -0.014668 0.1788063 unknown
polarizability: 141.311103|-10.2916554|109.1756265|12.200875|0.9134535|67.0837531 unknown
InChI: InChI=1S/C8H10N2O3/c11-6-3-4-10(8(12)9-6)7-2-1-5-13-7/h3-4,7,9H,1-2,5H2
charge 0 multiplicity 1
23 atoms
O  -2.205452 -0.576379 -1.20359
O  0.493544 2.3622 0.073387
O  3.775082 -0.908197 0.780622
N  -0.087668 0.109355 -0.262146
N  2.101736 0.686195 0.418708
C  -1.484896 0.557328 -0.653566
C  -2.300258 1.042511 0.565984
C  -2.944718 -0.266197 1.086866
C  -3.252001 -1.022513 -0.22017
C  0.821762 1.141121 0.077709
C  0.300854 -1.22489 -0.302197
C  1.568496 -1.636786 0.036126
C  2.581979 -0.666109 0.441546
H  -1.363666 1.326729 -1.432185
H  -3.074921 1.745869 0.211147
H  -1.673756 1.565791 1.302481
H  -2.228926 -0.829979 1.711012
H  -3.852759 -0.08085 1.683478
H  -3.179675 -2.12018 -0.138786
H  -4.235868 -0.747656 -0.641719
H  -0.474893 -1.911172 -0.64815
H  2.777042 1.414182 0.674276
H  1.851759 -2.688671 -0.004729
