program: Gaussian 09
title: 000267347
version: EM64L-G09RevD.01
frameworkgroup: C1[X(C10H10ClN3O4)]
method: RPBEPBE
basis: SDD
operation: Freq
keyword: #p
keyword: freq=noraman
keyword: PBEPBE/SDD
title: #p freq=noraman PBEPBE/SDD
converged: YES YES NO NO
title: Mulliken charges:
elementType: Cl O O O O N N N C C C C C C C C C C H H H H H H H H H H
charge: -0.038852 -0.262773 -0.260138 -0.255795 -0.230555 -0.480737 -0.191271 0.036307 0.237181 0.154533 0.551045 -0.460723 -0.466316 -0.302164 -0.202492 -0.333443 0.308067 -0.569655 0.321583 0.235012 0.255559 0.352504 0.240779 0.240860 0.271902 0.276897 0.279239 0.293448
chargesum: 0.00000
title: Mulliken charges with hydrogens summed into heavy atoms:
elementType: Cl O O O O N N N C C C C C C C C C C
charge: -0.038852 -0.262773 -0.260138 -0.255795 -0.230555 -0.128234 -0.191271 0.036307 0.237181 0.154533 0.551045 -0.139140 -0.231304 -0.046606 0.279147 0.215355 0.308067 0.003032
polarizability: 2.84473478e+02 -1.39235488e+01 1.63273750e+02 9.61882947e+00 9.62083827e+00 7.55375174e+01
1716.lowfreq: -40.5355 -1.4749 -0.2633 -0.0012 0.0013 0.0015 8.5680 27.2189 30.4818
frequency: -40.4884 26.9135 30.4774 37.9116 66.7062 80.2841 94.5832 129.4053 180.8159 181.5974 200.3424 224.7796 251.4810 292.8068 340.2824 348.1064 375.5301 421.3230 425.7753 449.5969 479.4491 538.9959 605.3293 609.9125 679.5581 680.7381 701.3962 715.2203 730.2455 763.7613 770.3675 782.9160 798.5834 818.5725 840.3364 849.3864 902.3622 918.5633 919.0989 933.7958 979.8321 1041.3912 1053.0815 1059.4327 1065.3567 1090.7322 1119.4335 1147.6908 1194.5925 1210.2127 1235.1388 1268.1425 1270.5785 1286.0701 1325.9483 1358.7026 1365.0910 1375.7793 1390.9572 1438.3404 1455.9925 1456.4833 1482.1696 1489.6491 1528.4732 1614.8570 1632.1896 1657.0287 3015.8003 3046.3578 3070.8684 3094.5549 3122.0285 3138.6198 3160.7258 3186.4072 3207.3172 3439.7936
redmass: 2.3313 6.5950 7.8961 11.8112 2.6765 8.3457 7.3306 8.0493 7.9303 8.6458 9.9030 6.3230 9.7015 6.0040 3.3822 6.7660 7.5718 5.7506 3.1759 9.2813 10.5187 7.2261 4.0072 7.2773 9.4972 7.2499 6.4175 4.5913 2.6048 4.2902 1.2595 3.0171 3.3487 1.3459 10.8466 4.8995 1.3791 3.0133 1.3474 4.0353 4.9988 2.3032 2.4607 3.2199 1.4551 3.2303 1.0364 1.4306 1.9101 2.0221 2.2813 1.2029 1.5188 3.3082 1.2277 1.3127 1.3287 6.7531 4.9137 1.1219 1.1554 3.6835 1.7831 1.6874 1.8527 6.9855 7.9095 9.2206 1.0534 1.0594 1.0558 1.1191 1.1046 1.0906 1.1129 1.0954 1.0939 1.0764
irintensity: 16.1177 0.0626 0.2843 0.0634 1.4886 2.2354 0.6275 9.6438 6.2213 5.9609 4.4654 0.1856 1.5518 0.2446 6.4446 0.3756 39.9505 4.4540 7.0194 10.9044 12.4310 14.0060 13.3537 6.4629 2.0853 7.6162 65.9063 2.7445 2.8557 40.3522 7.7134 16.1636 95.5681 125.3853 19.9431 24.8688 46.3695 151.9039 0.5801 7.5181 150.4970 67.8867 13.5508 10.4690 4.3909 33.1673 0.0022 16.5190 146.2557 26.3091 14.1273 13.3161 28.7683 144.4204 38.1037 17.4746 15.6236 196.6380 25.9586 29.7861 13.3348 49.9487 163.8914 143.5830 380.8450 23.7339 1.2375 252.1760 133.5115 1.9912 12.6932 30.8142 1.2535 7.6838 2.5128 3.0121 11.4242 58.7929
temp: 298.150 k
press: 1.00000 atm
elementType: 17 8 8 8 8 7 7 7 6 6 6 6 6 6 6 6 6 6 1 1 1 1 1 1 1 1 1 1
symmnumber: 1
zpe: 522009.2 jmol-1
zpe.correction: 0.198823 hartree
zpe.thermalcorrener: 0.214816 hartree
zpe.thermalcorrenthalpy: 0.215760 hartree
zpe.thermalcorrgfe: 0.152373 hartree
zpe.sumelectzpe: -1310.881151 hartree
zpe.sumelectthermal: -1310.865158 hartree
zpe.sumelectthermalent: -1310.864213 hartree
zpe.sumelectthermalfe: -1310.927600 hartree
dipole: 3.6281 1.0553 0.4118
dipole: 3.8008
quadrupole: -114.3859 -115.9188 -109.4605
quadrupole: -3.7175 0.3896 -0.4045
quadrupole: -1.1308 -2.6637 3.7945 -3.7175 0.3896 -0.4045
hfenergy: -1311.0799737 hartree
pointgroup: C01 [X(C10H10Cl1N3O4)]
dipole: 1.4019679 -0.5007729 -0.1406352 debye
polarizability: 285.8470709|6.4918199|162.350632|-7.0794502|8.9001268|75.087042 unknown
InChI: InChI=1S/C10H10ClN3O4/c11-3-4-14(13-16)10(15)12-7-1-2-8-9(5-7)18-6-17-8/h1-2,5,12H,3-4,6H2
charge 0 multiplicity 1
28 atoms
Cl -5.984339 2.161478 -0.39664
O  3.726621 1.863795 0.15691
O  5.07213 -0.09643 -0.206687
O  -1.311465 1.395428 0.425756
O  -4.131496 -2.227513 0.046384
N  -0.492884 -0.801608 0.071738
N  -2.812488 -0.405906 0.279948
N  -2.935626 -1.784375 0.056325
C  2.907544 0.715377 0.052152
C  3.698079 -0.433958 -0.161619
C  0.91703 -0.611357 0.001507
C  1.517117 0.676838 0.141035
C  1.706534 -1.773116 -0.214263
C  3.120126 -1.697666 -0.299016
C  5.124456 1.378158 -0.000938
C  -3.974661 0.47751 0.525067
C  -1.46127 0.153348 0.267464
C  -4.490049 1.084834 -0.790502
H  0.914096 1.569572 0.307714
H  1.219309 -2.74934 -0.317435
H  3.728543 -2.589712 -0.464166
H  -0.850602 -1.759572 -0.037616
H  5.685599 1.591656 0.92492
H  5.56973 1.849561 -0.893676
H  -4.7613 -0.136532 0.995228
H  -3.651171 1.277091 1.208379
H  -4.845942 0.320319 -1.495737
H  -3.748921 1.751322 -1.253234
