program: Gaussian 09
title: 000267342
version: EM64L-G09RevD.01
frameworkgroup: C1[X(C10H12BrN3O2)]
method: RPBEPBE
basis: SDD
operation: Freq
keyword: #p
keyword: freq=noraman
keyword: PBEPBE/SDD
title: #p freq=noraman PBEPBE/SDD
converged: YES YES NO NO
title: Mulliken charges:
elementType: Br O O N N N C C C C C C C C C C H H H H H H H H H H H H
charge: 0.002976 -0.252965 -0.229688 -0.189852 -0.468567 0.038470 0.478220 -0.332910 0.448915 -0.340344 -0.441869 -0.378333 -0.364646 0.306539 -0.664916 -0.806256 0.275878 0.280932 0.347764 0.296425 0.228056 0.233499 0.234365 0.295610 0.311890 0.225110 0.227705 0.237993
chargesum: 0.00000
title: Mulliken charges with hydrogens summed into heavy atoms:
elementType: Br O O N N N C C C C C C C C C C
charge: 0.002976 -0.252965 -0.229688 -0.189852 -0.120803 0.038470 0.478220 0.223899 0.448915 -0.043919 -0.213813 -0.144834 -0.130282 0.306539 -0.057416 -0.115448
polarizability: 2.73439973e+02 8.73531040e+00 1.56669579e+02 1.26369522e+01 -1.08648629e+01 7.65074580e+01
1716.lowfreq: -22.5180 -10.6082 -5.7216 -1.5812 -0.0007 -0.0006 0.0003 19.0470 26.2009
frequency: -22.3056 18.9895 26.0950 43.8757 56.4515 76.9746 98.2792 120.9529 156.5418 169.7101 201.7187 246.2188 285.6430 335.6569 345.5096 361.7435 378.7525 408.7732 430.5091 478.0636 516.4823 534.2935 635.3834 639.4635 689.4231 716.9553 722.4800 760.6727 771.8996 787.2324 830.3741 832.5304 850.9547 851.7328 910.7914 948.8212 984.1579 988.8737 1008.9476 1020.7571 1042.8518 1047.4740 1088.3574 1131.8602 1194.6326 1204.0914 1224.1518 1231.8177 1238.8334 1264.0877 1315.0223 1324.9320 1352.7712 1370.8948 1377.3166 1398.4886 1414.7763 1434.7055 1447.5233 1470.1804 1473.4867 1508.1856 1523.6557 1595.6718 1627.4723 1658.4715 2975.1708 3046.3352 3056.3386 3068.2720 3085.9151 3114.4898 3120.9233 3130.2595 3141.3578 3160.4171 3191.6146 3441.2274
redmass: 1.0213 6.2702 5.6377 5.5125 2.6353 5.7791 6.1861 8.4563 8.8211 4.3158 6.7965 8.4963 3.9890 3.0498 4.3859 4.2258 5.2708 2.9442 9.3896 10.3653 2.5550 5.8803 6.9683 5.6317 6.9410 2.9830 2.0784 2.6808 1.2209 2.8964 1.4564 5.5388 1.2754 5.3751 2.6526 1.3469 1.3404 1.4017 2.9828 1.5628 4.3470 1.5537 3.9816 1.3034 1.1121 1.9450 2.5244 2.4231 1.2282 2.9975 1.3311 1.2013 1.3147 6.7724 5.5932 1.2226 3.4069 1.1215 1.0967 1.1133 1.0538 2.3277 2.2680 4.5378 6.2946 9.4518 1.0390 1.0592 1.0947 1.0556 1.0998 1.0879 1.1049 1.0909 1.0965 1.1126 1.0944 1.0763
irintensity: 0.5769 0.0074 0.4346 0.0434 0.7592 0.6830 1.0751 9.4529 5.2286 0.4673 16.0647 1.1867 0.6404 8.0483 2.3102 14.6091 16.8297 0.1159 5.7228 6.4517 32.0096 8.6377 0.4034 48.9438 11.6296 1.5012 3.3040 38.9850 37.4474 93.6526 102.4342 1.8237 13.8578 30.7675 131.1437 6.2835 3.0035 1.6969 1.5232 102.5255 2.0186 20.3286 45.5735 11.4279 0.4785 3.9807 5.3270 47.0837 8.6496 4.5838 10.7961 23.9037 15.7147 162.6635 78.9250 7.5356 28.5179 28.9013 10.0063 42.1640 13.2390 0.8846 573.2386 56.2478 2.0961 266.8289 39.7100 2.1386 22.7739 10.1925 17.3489 14.4145 1.1372 21.6081 15.3486 0.8004 2.4660 55.7675
temp: 298.150 k
press: 1.00000 atm
elementType: 35 8 8 7 7 7 6 6 6 6 6 6 6 6 6 6 1 1 1 1 1 1 1 1 1 1 1 1
symmnumber: 1
zpe: 554688.8 jmol-1
zpe.correction: 0.211270 hartree
zpe.thermalcorrener: 0.226843 hartree
zpe.thermalcorrenthalpy: 0.227787 hartree
zpe.thermalcorrgfe: 0.164416 hartree
zpe.sumelectzpe: -715.205906 hartree
zpe.sumelectthermal: -715.190332 hartree
zpe.sumelectthermalent: -715.189388 hartree
zpe.sumelectthermalfe: -715.252760 hartree
dipole: -4.0701 0.4432 -0.3724
dipole: 4.1110
quadrupole: -95.8310 -108.9261 -104.0941
quadrupole: -1.5067 1.9122 0.1581
quadrupole: 7.1194 -5.9757 -1.1437 -1.5067 1.9122 0.1581
hfenergy: -715.4171757 hartree
pointgroup: C01 [X(C10H12Br1N3O2)]
dipole: -1.5693077 -0.3767953 0.1063629 debye
polarizability: 274.1047884|6.4710481|157.1249524|-7.6515157|-9.2327541|75.3872691 unknown
InChI: InChI=1S/C10H12BrN3O2/c1-8-2-4-9(5-3-8)12-10(15)14(13-16)7-6-11/h2-5,12H,6-7H2,1H3
charge 0 multiplicity 1
28 atoms
Br 5.782567 1.860129 0.369683
O  0.966154 1.487768 -0.466428
O  3.364445 -2.415959 0.012093
N  2.255057 -0.465081 -0.27316
N  -0.097928 -0.594673 -0.075516
N  2.225376 -1.842855 -0.019773
C  -1.478433 -0.242474 -0.016871
C  3.508371 0.281519 -0.530018
C  -4.280735 0.298991 0.129804
C  -1.952686 1.085701 -0.169681
C  -2.403492 -1.294501 0.211106
C  -3.338719 1.335442 -0.092882
C  -3.782934 -1.020972 0.283673
C  0.972419 0.240636 -0.282316
C  4.050373 0.896654 0.771771
C  -5.77085 0.585828 0.177404
H  4.233928 -0.435006 -0.950169
H  3.285455 1.073747 -1.260601
H  0.146701 -1.584969 0.054756
H  -1.245252 1.899264 -0.340949
H  -2.043553 -2.323829 0.334948
H  -3.69472 2.366223 -0.209004
H  -4.482977 -1.845449 0.463314
H  4.3054 0.136691 1.524647
H  3.373834 1.66168 1.178537
H  -6.302817 -0.134651 0.823379
H  -5.975767 1.601617 0.558629
H  -6.222616 0.517531 -0.831577
