program: Gaussian 09
title: 000267332
version: EM64L-G09RevD.01
frameworkgroup: C1[X(C14H11NO)]
method: RPBEPBE
basis: SDD
operation: Freq
keyword: #p
keyword: freq=noraman
keyword: PBEPBE/SDD
title: #p freq=noraman PBEPBE/SDD
converged: NO YES NO YES
title: Mulliken charges:
elementType: O N C C C C C C C C C C C C C C H H H H H H H H H H H
charge: -0.227940 -0.489411 0.177409 0.194886 0.244150 0.220091 -0.502682 -0.394605 0.368284 -0.392455 -0.369211 -0.396990 -0.253048 -0.210439 0.098868 -0.793184 0.306697 0.246137 0.238856 0.237919 0.234959 0.275551 0.226261 0.225778 0.235802 0.235762 0.262557
chargesum: 0.00000
title: Mulliken charges with hydrogens summed into heavy atoms:
elementType: O N C C C C C C C C C C C C C C
charge: -0.227940 -0.182714 0.177409 0.194886 0.244150 0.220091 -0.256545 -0.155750 0.368284 -0.154537 -0.134251 -0.121439 -0.026787 0.015338 0.098868 -0.059063
polarizability: 3.06765271e+02 -4.42506245e+00 1.59812763e+02 5.81083379e-03 2.27797043e-03 6.68560520e+01
1716.lowfreq: -3.8722 -2.4911 -0.0007 -0.0003 0.0003 8.5735 55.3388 61.7494 133.1714
frequency: 55.2672 61.7483 133.1709 145.2863 156.4095 175.1832 228.6830 306.2660 311.1800 316.9560 408.0441 423.8822 449.6173 492.2859 500.3267 529.5561 532.6891 554.1265 569.7753 590.0947 647.5290 655.4083 704.4090 737.3105 747.7909 755.2854 781.9633 851.4263 856.6247 860.9147 875.7324 910.0522 940.6092 943.6256 977.3842 987.1049 989.0427 1016.1512 1025.5779 1065.3139 1109.5644 1132.4421 1169.3109 1206.9578 1223.1543 1238.6073 1261.2877 1297.7196 1324.5526 1338.8316 1363.6115 1388.0920 1413.2748 1448.7128 1452.9497 1459.2783 1463.3772 1490.0915 1491.4504 1562.8317 1587.9792 1595.2523 1622.4063 1640.0277 2984.1705 3069.6964 3125.3787 3128.4681 3136.4926 3139.8536 3146.7394 3149.3727 3166.5907 3167.1424 3609.9177
redmass: 3.7664 7.5872 5.0416 3.7067 1.0577 4.8020 4.1543 4.4648 8.1206 5.0800 3.5196 2.9870 2.9739 5.7286 1.1508 4.6685 3.2133 6.6359 3.5379 4.5536 6.3699 3.0933 5.6255 2.5800 5.9208 1.6774 2.7713 1.3565 5.1231 1.6154 1.5453 4.5485 1.3954 2.0096 1.3157 1.3404 7.1057 2.0440 1.8355 1.9840 1.8249 1.3815 1.0830 1.9175 1.8567 1.7202 2.2842 2.0074 3.3276 1.7759 1.2967 3.9370 4.2825 1.1401 3.3148 3.2761 1.0500 3.3232 3.6859 7.0235 6.4786 7.9053 6.7204 7.8740 1.0372 1.0971 1.0992 1.0854 1.0892 1.0890 1.0912 1.0954 1.0989 1.0969 1.0802
irintensity: 3.2409 0.4447 1.3752 1.6352 1.2246 1.1875 3.2064 2.3791 3.9291 0.0082 1.0372 7.7397 1.2494 17.4962 97.3586 1.0697 5.6165 0.2930 3.9814 11.4980 6.5214 4.5339 5.4854 42.9655 0.1649 67.1595 12.8024 25.2112 1.3521 10.2438 28.0713 6.2740 2.3572 35.3411 0.0028 1.1021 9.5178 3.4416 0.9272 1.7323 18.4772 1.4861 3.0493 41.5657 46.8397 15.1379 120.9953 165.6145 61.9126 84.3327 74.3226 3.0012 12.2156 43.3840 34.0653 4.8417 19.9719 50.4417 17.0281 151.7873 7.4414 92.6803 25.0988 28.2981 4.5061 14.2833 20.3233 0.7217 3.4539 4.3340 7.2829 29.2727 19.0178 21.4551 50.6339
temp: 298.150 k
press: 1.00000 atm
elementType: 8 7 6 6 6 6 6 6 6 6 6 6 6 6 6 6 1 1 1 1 1 1 1 1 1 1 1
symmnumber: 1
zpe: 552527.5 jmol-1
zpe.correction: 0.210447 hartree
zpe.thermalcorrener: 0.223031 hartree
zpe.thermalcorrenthalpy: 0.223975 hartree
zpe.thermalcorrgfe: 0.171419 hartree
zpe.sumelectzpe: -669.003947 hartree
zpe.sumelectthermal: -668.991362 hartree
zpe.sumelectthermalent: -668.990418 hartree
zpe.sumelectthermalfe: -669.042975 hartree
dipole: 3.4370 -3.9403 -0.0007
dipole: 5.2286
quadrupole: -101.2829 -77.1278 -98.3333
quadrupole: 10.4813 0.0041 -0.0009
quadrupole: -9.0349 15.1202 -6.0853 10.4813 0.0041 -0.0009
hfenergy: -669.2143933 hartree
pointgroup: C01 [X(C14H11N1O1)]
dipole: -1.3728432 1.5319858 -0.0002569 debye
polarizability: 306.8574262|-2.4556642|159.7206083|-0.0057798|-0.0023556|66.856052 unknown
InChI: InChI=1S/C14H11NO/c1-9(16)10-6-7-12-11-4-2-3-5-13(11)15-14(12)8-10/h2-8,15H,1H3
charge 0 multiplicity 1
27 atoms
O  4.731264 -0.913831 0.000297
N  -0.896991 1.630335 -0.000152
C  -0.33508 -0.606995 -0.000169
C  -1.78711 -0.497205 -0.000084
C  0.186991 0.735261 -0.000214
C  -2.101354 0.907852 -0.000073
C  1.567918 1.002287 -0.000297
C  0.570568 -1.696942 -0.000215
C  2.46077 -0.10204 -0.000358
C  -2.839464 -1.444361 -0.000013
C  -3.432582 1.375743 0.000006
C  1.950992 -1.439938 -0.000299
C  -4.17213 -0.984386 0.000066
C  -4.46234 0.410503 0.000075
C  3.950681 0.085072 -0.000481
C  4.520082 1.503317 0.000113
H  -0.821889 2.644924 -0.00019
H  1.943622 2.030666 -0.00032
H  0.200716 -2.727931 -0.00018
H  -2.623803 -2.518405 -0.000018
H  -3.666721 2.445865 0.000014
H  2.681818 -2.254533 -0.000346
H  -4.997649 -1.703959 0.000122
H  -5.506946 0.741412 0.000137
H  4.186455 2.064461 0.892942
H  4.187191 2.064889 -0.892716
H  5.618891 1.44594 0.000555
