program: Gaussian 09
title: 000267330
version: EM64L-G09RevD.01
frameworkgroup: C1[X(C14H12N2O)]
method: RPBEPBE
basis: SDD
operation: Freq
keyword: #p
keyword: freq=noraman
keyword: PBEPBE/SDD
title: #p freq=noraman PBEPBE/SDD
converged: YES YES NO NO
title: Mulliken charges:
elementType: O N N C C C C C C C C C C C C C C H H H H H H H H H H H H
charge: -0.268259 -0.488565 -0.607038 0.164385 0.240585 0.197415 0.217402 -0.546366 0.470158 -0.396502 -0.422927 -0.400812 -0.368494 -0.649906 -0.253781 -0.214262 0.201995 0.306963 0.246409 0.237161 0.241798 0.234890 0.250311 0.247587 0.234224 0.224607 0.224730 0.348505 0.327786
chargesum: 0.00000
title: Mulliken charges with hydrogens summed into heavy atoms:
elementType: O N N C C C C C C C C C C C C C C
charge: -0.268259 -0.181602 0.069254 0.164385 0.240585 0.197415 0.217402 -0.299957 0.470158 -0.159341 -0.181129 -0.165922 -0.134270 -0.152008 -0.029174 0.010469 0.201995
polarizability: 2.96632316e+02 -1.24854306e-01 1.53272339e+02 2.10203739e+01 2.08900620e+00 8.87910043e+01
1716.lowfreq: -6.2866 -5.4203 -0.0004 0.0002 0.0004 3.6456 25.0114 30.7897 46.9535
frequency: 24.9824 30.7492 46.9499 114.8852 149.2353 179.0976 235.2308 288.5143 302.7759 334.7888 352.4602 428.6340 448.8919 455.9228 491.6435 503.5148 513.8876 521.3024 553.6939 566.9917 571.3595 594.5272 641.2313 657.1751 672.4542 730.1395 736.7318 754.2371 769.6335 785.4413 816.3254 846.5411 856.6901 857.5979 881.5122 912.2417 937.1377 954.1133 959.5428 974.6074 989.0977 1017.2118 1061.3002 1108.9091 1136.4018 1161.5842 1168.8071 1176.5731 1218.5101 1233.8936 1251.4088 1268.2303 1296.2225 1320.8262 1338.9365 1341.0154 1388.6715 1414.9532 1447.7918 1451.8025 1460.0970 1487.5137 1498.2621 1577.8638 1580.8996 1590.4768 1622.9538 1640.1975 1645.4943 3006.8080 3064.7780 3124.8745 3127.4560 3129.6491 3135.0474 3148.1099 3150.0898 3165.9306 3508.2203 3610.8240 3664.5706
redmass: 6.7322 4.3785 6.1404 5.6552 3.7636 3.7308 5.2331 3.5924 4.4752 3.8324 4.3811 3.1651 3.0967 4.8390 2.0046 1.1531 3.2706 2.8694 6.3133 1.1824 3.6165 5.0972 5.2974 1.6715 4.1121 4.2916 2.8792 1.7807 2.8377 3.6879 2.3944 1.8053 5.1364 1.5320 1.7187 2.2496 1.3956 1.3791 2.4804 1.3106 7.1723 2.0269 1.8495 1.8342 1.4588 1.7584 1.0929 1.1520 1.9083 1.4202 2.2767 1.7115 2.1768 2.5452 2.8695 1.7963 3.8368 3.7551 2.5777 1.3393 2.9766 3.5378 3.5713 1.8937 3.0648 6.4670 6.6301 5.5476 5.4739 1.0617 1.0991 1.0873 1.0853 1.0920 1.0894 1.0954 1.0967 1.1002 1.0447 1.0802 1.1043
irintensity: 6.4421 4.4505 0.7214 4.4778 0.0849 0.9599 0.3719 4.4741 1.0564 8.4746 1.8884 16.8691 0.9803 1.0077 8.4819 90.6795 21.0220 7.7106 1.9178 163.0098 2.5722 4.2916 6.2720 57.3100 9.2315 9.0723 37.9647 55.8943 32.1978 4.1237 11.8961 8.8927 0.4769 0.7087 22.9934 0.9962 2.6609 1.6423 2.5502 0.0123 8.3850 4.7994 3.8791 7.3731 7.8961 4.0028 2.5796 0.5388 6.9427 24.1836 46.4967 35.6298 12.7832 9.2375 118.4607 59.8238 14.2620 16.8195 26.7259 16.0391 40.2521 27.6869 1.0750 133.3858 53.5901 1.7604 103.2597 174.4573 161.9445 19.2417 4.7630 7.6290 0.3460 13.3438 2.4096 20.0224 24.4575 33.6219 29.6370 49.9863 65.4254
temp: 298.150 k
press: 1.00000 atm
elementType: 8 7 7 6 6 6 6 6 6 6 6 6 6 6 6 6 6 1 1 1 1 1 1 1 1 1 1 1 1
symmnumber: 1
zpe: 599243.3 jmol-1
zpe.correction: 0.228240 hartree
zpe.thermalcorrener: 0.241877 hartree
zpe.thermalcorrenthalpy: 0.242821 hartree
zpe.thermalcorrgfe: 0.186334 hartree
zpe.sumelectzpe: -724.293095 hartree
zpe.sumelectthermal: -724.279458 hartree
zpe.sumelectthermalent: -724.278514 hartree
zpe.sumelectthermalfe: -724.335001 hartree
dipole: 4.2699 -0.5197 1.0081
dipole: 4.4180
quadrupole: -125.9562 -83.3982 -98.5091
quadrupole: -8.4093 -0.8807 1.9334
quadrupole: -23.3350 19.2229 4.1121 -8.4093 -0.8807 1.9334
hfenergy: -724.5213347 hartree
pointgroup: C01 [X(C14H12N2O1)]
dipole: -1.6455302 0.1781271 0.5307528 debye
polarizability: 291.1640131|2.3613381|152.6157969|-39.0187014|-7.9467637|94.9158489 unknown
InChI: InChI=1S/C14H12N2O/c15-14(17)8-9-5-6-11-10-3-1-2-4-12(10)16-13(11)7-9/h1-7,16H,8,15H2
charge 0 multiplicity 1
29 atoms
O  5.838722 0.76182 -0.323924
N  -1.125126 1.621525 -0.295057
N  4.152129 0.08278 1.121602
C  -0.49566 -0.595144 -0.234262
C  -0.040438 0.748611 -0.476746
C  -1.912061 -0.510137 0.104863
C  -2.269441 0.882917 0.056853
C  1.292073 1.03533 -0.836067
C  2.205001 -0.040528 -0.96145
C  0.424356 -1.660873 -0.364845
C  1.758597 -1.378402 -0.72422
C  -2.898636 -1.46696 0.440306
C  -3.578083 1.329619 0.334673
C  3.657219 0.225972 -1.315911
C  -4.210363 -1.028613 0.719851
C  -4.543783 0.354303 0.666798
C  4.645136 0.386229 -0.132199
H  -1.090816 2.632049 -0.40709
H  1.626226 2.063132 -1.019576
H  0.107185 -2.695881 -0.196551
H  2.47375 -2.201362 -0.840491
H  -2.650855 -2.533411 0.482376
H  4.067773 -0.591339 -1.938396
H  3.763706 1.148437 -1.914297
H  -3.843639 2.391686 0.296137
H  -4.984724 -1.757853 0.980668
H  -5.569869 0.668835 0.887731
H  3.185482 -0.213986 1.253667
H  4.776643 0.163549 1.923259
