program: Gaussian 09
title: 000267329
version: EM64L-G09RevD.01
frameworkgroup: C1[X(C13H11N3O4)]
method: RPBEPBE
basis: SDD
operation: Freq
keyword: #p
keyword: freq=noraman
keyword: PBEPBE/SDD
title: #p freq=noraman PBEPBE/SDD
converged: YES YES NO NO
title: Mulliken charges:
elementType: O O O O N N N C C C C C C C C C C C C C H H H H H H H H H H H
charge: -0.195322 -0.221055 -0.215784 -0.209428 -0.242535 0.003933 0.017502 0.305376 0.402330 0.237972 -0.277986 -0.656120 -0.502766 0.429850 -0.408090 -0.348757 -0.383741 -0.204828 -0.205731 -0.237604 0.277441 0.291333 0.241011 0.245963 0.329446 0.291478 0.273086 0.248342 0.238972 0.236467 0.239247
chargesum: 0.00000
title: Mulliken charges with hydrogens summed into heavy atoms:
elementType: O O O O N N N C C C C C C C C C C C C C
charge: -0.195322 -0.221055 -0.215784 -0.209428 -0.242535 0.003933 0.017502 0.305376 0.402330 0.237972 -0.000546 0.122187 -0.173320 0.429850 -0.116612 -0.075671 -0.135399 0.034143 0.030736 0.001643
polarizability: 3.14771064e+02 -3.74720112e+00 1.93127983e+02 -3.75713032e+00 -2.97169393e+00 1.16767040e+02
1716.lowfreq: -0.0005 -0.0005 -0.0004 2.0776 7.6958 10.4046 30.6435 44.1333 54.4231
frequency: 30.6410 44.0916 54.4127 63.4203 72.4024 104.9922 150.9055 157.7106 169.6380 203.7628 234.2254 246.5059 277.1482 311.8995 331.7109 352.9057 363.6647 407.3164 432.3457 444.6783 494.6995 504.7113 522.9968 554.1349 594.3206 613.3244 628.4871 637.7728 674.3840 700.2105 705.2293 709.8879 736.3975 752.1904 774.4828 831.1061 840.3624 849.6512 894.7622 924.8275 955.0189 978.3305 988.2053 993.0120 999.4141 1021.3830 1046.6950 1065.7306 1084.6086 1106.2651 1111.3488 1129.9907 1151.0873 1175.5210 1184.0107 1192.3477 1210.3815 1245.0222 1274.5851 1311.3548 1344.9952 1349.9970 1356.2940 1377.8605 1389.9726 1436.4299 1439.3155 1445.1682 1464.4886 1472.8856 1484.5337 1498.7329 1565.7384 1591.4821 1602.1681 1614.6775 2986.9080 3077.9798 3109.9428 3133.9262 3139.5710 3150.6984 3159.2436 3169.4951 3173.7068 3186.0574 3189.4362
redmass: 4.7980 5.4021 7.5492 8.8435 7.5024 7.2864 5.4889 7.7792 4.5364 3.8558 5.0953 1.2521 4.6003 8.2145 4.4546 5.7989 5.3812 2.8674 3.8830 6.4709 6.9007 4.6562 4.1869 5.1443 4.2056 6.3398 7.0111 7.9077 8.1955 1.9707 7.0430 7.1318 4.8665 9.8152 1.8835 2.1545 2.2455 1.2690 5.8271 1.4038 1.4320 1.3887 5.8859 1.3283 1.3196 2.4736 2.7271 2.6667 1.7042 1.3282 2.9643 1.8628 1.4131 1.0528 1.1154 9.2820 3.9957 3.0162 1.9298 1.4255 7.9492 3.0316 8.2520 7.2838 6.3631 1.3666 2.4949 3.5210 1.0964 1.4676 1.8876 2.0722 8.9984 6.3993 6.2705 6.7531 1.0346 1.0999 1.1011 1.0858 1.0881 1.0927 1.0969 1.0882 1.1018 1.0921 1.0968
irintensity: 1.9833 0.1613 0.1056 0.7751 1.2619 3.1734 2.4699 1.7641 6.8112 2.3015 0.8499 0.7143 1.4968 0.5198 1.6969 0.6540 1.7437 0.1764 6.0499 8.4209 2.7417 1.8162 10.5786 2.2539 17.2130 0.1953 2.7036 13.7483 26.5037 35.5046 22.4714 6.2994 5.5725 9.6273 38.4674 11.7419 17.3163 2.9742 17.1372 1.2031 21.4356 1.2144 4.0628 4.6403 0.0473 11.0245 20.6379 20.9163 17.5225 5.7466 9.7103 75.3171 1.6470 0.1579 0.9194 489.2828 458.4854 127.1551 18.8998 3.5332 138.5047 75.2685 51.5153 4.9592 23.9768 26.4397 6.2054 4.8775 13.1022 71.2166 10.0605 166.4105 75.5868 5.7195 126.9603 176.3566 30.0043 7.8998 11.3892 4.3713 0.6381 13.4268 17.7183 1.2697 17.3760 14.0304 7.4285
temp: 298.150 k
press: 1.00000 atm
elementType: 8 8 8 8 7 7 7 6 6 6 6 6 6 6 6 6 6 6 6 6 1 1 1 1 1 1 1 1 1 1 1
symmnumber: 1
zpe: 589366.2 jmol-1
zpe.correction: 0.224478 hartree
zpe.thermalcorrener: 0.241505 hartree
zpe.thermalcorrenthalpy: 0.242449 hartree
zpe.thermalcorrgfe: 0.178316 hartree
zpe.sumelectzpe: -965.535931 hartree
zpe.sumelectthermal: -965.518904 hartree
zpe.sumelectthermalent: -965.517960 hartree
zpe.sumelectthermalfe: -965.582093 hartree
dipole: 9.1946 -1.6795 -1.5902
dipole: 9.4810
quadrupole: -129.6418 -130.3036 -108.3077
quadrupole: -10.1959 -3.0321 -6.7021
quadrupole: -6.8908 -7.5526 14.4433 -10.1959 -3.0321 -6.7021
hfenergy: -965.760409 hartree
pointgroup: C01[X(C13H11N3O4)]
dipole: -3.533646 1.1726621 -0.2279336 debye
polarizability: 312.6284972|-16.2508802|186.3926827|-3.8974212|25.1370738|125.6449067 unknown
InChI: InChI=1S/C13H11N3O4/c1-14(10-5-3-2-4-6-10)12-8-7-11(15(17)18)9-13(12)16(19)20/h2-9H,1H3
charge 0 multiplicity 1
31 atoms
O  1.868232 -3.213801 -1.209621
O  -0.0814 -3.027147 -0.034713
O  4.37105 2.357005 0.451887
O  5.096137 0.278529 -0.166802
N  -1.266156 -0.407626 -0.76367
N  0.956039 -2.511148 -0.620934
N  4.158177 1.132901 0.085102
C  0.046651 -0.125838 -0.397825
C  -2.358494 0.356337 -0.193356
C  1.14689 -1.051741 -0.527279
C  0.38671 1.206025 0.030816
C  -1.621026 -1.474101 -1.723624
C  2.488561 -0.632109 -0.409694
C  2.761576 0.695155 -0.055045
C  1.707425 1.614497 0.198361
C  -2.539765 0.3662 1.212394
C  -3.258312 1.060344 -1.030582
C  -3.614175 1.086994 1.776308
C  -4.336571 1.771157 -0.459215
C  -4.517346 1.788759 0.943475
H  -0.420871 1.928543 0.17082
H  -1.843371 -2.426398 -1.209432
H  -2.506957 -1.153429 -2.294134
H  -0.789345 -1.64336 -2.428748
H  3.300992 -1.350229 -0.547871
H  1.953414 2.638976 0.489179
H  -1.850071 -0.199934 1.84718
H  -3.104478 1.070877 -2.115265
H  -3.753643 1.088129 2.862536
H  -5.027596 2.319345 -1.10836
H  -5.354178 2.341889 1.382609
