program: Gaussian 09
title: 000267292
version: EM64L-G09RevD.01
frameworkgroup: C1[X(C12H11N5)]
method: RPBEPBE
basis: SDD
operation: Freq
keyword: #pfreq=noraman
keyword: PBEPBE/SDD
title: #p freq=noraman PBEPBE/SDD
converged: YES YES NO NO
title: Mulliken charges:
elementType: N N N N N C C C C C C C C C C C C H H H H H H H H H H H
charge: -0.090092 -0.043904 -0.129961 -0.610736 -0.099398 0.088363 -0.269436 0.130572 0.135291 -0.187140 -0.286192 -0.167214 -0.358736 -0.184972 -0.331525 -0.174503 -0.358201 0.291146 0.243751 0.257377 0.234095 0.244196 0.237422 0.265128 0.230675 0.240286 0.342454 0.351255
chargesum: 0.00000
title: Mulliken charges with hydrogens summed into heavy atoms:
elementType: N N N N N C C C C C C C C C C C C
charge: -0.090092 -0.043904 -0.129961 0.082973 -0.099398 0.088363 0.021710 0.130572 0.135291 0.056611 -0.028815 0.066881 -0.114540 0.052450 -0.066397 0.056172 -0.117915
polarizability: 4.10058894e+02 -1.30168781e+01 1.62410826e+02 1.62492130e-02 4.58398126e-04 6.34824539e+01
1716.lowfreq: -4.4103 -0.0010 -0.0004 0.0001 3.8725 12.5058 30.6207 39.7575 50.6092
frequency: 30.6134 39.7500 50.5737 81.3002 128.4392 129.3074 172.9784 237.9737 241.3683 263.6403 325.3726 367.6774 407.7386 409.7179 465.4936 474.2649 490.6594 528.1230 609.9422 617.7008 632.1396 653.5582 671.0723 677.4248 712.9282 745.1985 753.6466 788.4035 802.6049 808.7423 865.2562 902.1403 915.9008 952.0060 958.4645 966.1345 969.2164 971.3334 982.2409 1003.4112 1014.8055 1032.8859 1033.8148 1080.0946 1083.0659 1095.6922 1157.2327 1157.9189 1175.0551 1234.9064 1279.0426 1283.2307 1316.7066 1326.1924 1333.1473 1397.2647 1409.7308 1420.4437 1448.0399 1470.8109 1480.1868 1548.8733 1554.1579 1563.5087 1577.5760 1588.1472 1599.1991 3075.3452 3126.9458 3133.8749 3139.7502 3147.9141 3162.2355 3169.9576 3173.8860 3182.9736 3491.4632 3656.9248
redmass: 4.4654 5.5596 5.3865 4.6492 5.5519 5.3121 5.3085 5.7734 2.9504 4.5866 5.4345 4.6423 3.4948 3.5242 3.3788 6.0861 5.9254 3.1852 7.5054 7.3256 1.5055 5.7637 1.4896 5.9061 1.5004 1.8545 1.8336 1.9748 4.2963 2.3174 3.4490 1.3127 1.3124 6.9098 1.4249 7.1944 1.4575 1.5239 7.3718 1.3415 1.3408 2.2941 2.2731 1.7684 1.6524 2.0724 1.1952 1.0802 2.4127 1.7167 1.6409 1.5424 3.8474 6.6800 3.4694 2.2708 1.9190 1.9566 2.4254 2.6230 2.2336 2.7628 5.6414 5.3579 5.9376 6.6558 5.8039 1.0894 1.0881 1.0884 1.0895 1.0904 1.0946 1.0967 1.1005 1.0989 1.0430 1.1051
irintensity: 1.3537 1.2120 1.9749 2.3150 5.8404 0.1828 0.1134 7.8166 6.2845 10.2258 1.8958 5.1025 8.2651 0.0523 12.3329 0.4448 0.2943 7.7680 7.6906 2.9175 91.1681 14.0103 159.8263 16.1598 25.9892 44.3346 24.8828 39.0686 0.7869 25.1091 5.4048 0.1099 0.5411 31.5743 1.6296 4.6962 1.1331 29.6862 58.9182 0.7711 0.8322 10.8069 5.6254 1.8293 10.7070 6.9607 5.3113 2.1400 20.4064 1.9380 12.0895 12.2029 7.8434 2.0905 1.7477 24.9360 44.8743 18.8552 165.6098 55.4548 180.6150 280.5710 20.3982 11.8622 66.4520 16.4286 231.7711 12.9549 26.3788 16.4600 11.1833 13.8323 26.7187 25.4241 23.2774 12.1341 110.4342 84.7268
temp: 298.150 k
press: 1.00000 atm
elementType: 7 7 7 7 7 6 6 6 6 6 6 6 6 6 6 6 6 1 1 1 1 1 1 1 1 1 1 1
symmnumber: 1
zpe: 561811.0 jmol-1
zpe.correction: 0.213982 hartree
zpe.thermalcorrener: 0.228031 hartree
zpe.thermalcorrenthalpy: 0.228975 hartree
zpe.thermalcorrgfe: 0.171257 hartree
zpe.sumelectzpe: -736.419009 hartree
zpe.sumelectthermal: -736.404960 hartree
zpe.sumelectthermalent: -736.404016 hartree
zpe.sumelectthermalfe: -736.461735 hartree
dipole: -1.6548 1.9958 0.0035
dipole: 2.5926
quadrupole: -61.9760 -89.8765 -104.3999
quadrupole: 11.8540 -0.0169 0.0225
quadrupole: 23.4414 -4.4590 -18.9824 11.8540 -0.0169 0.0225
hfenergy: -736.6329918 hartree
pointgroup: C01 [X(C12H11N5)]
dipole: 0.6209244 0.4140244 0.6952885 debye
polarizability: 408.4219238|2.9612327|91.2569585|24.3807165|44.6171886|136.2732916 unknown
InChI: InChI=1S/C12H11N5/c13-12(11-6-2-4-8-15-11)17-16-9-10-5-1-3-7-14-10/h1-9H,13H2
charge 0 multiplicity 1
28 atoms
N  3.798099 0.473684 1.103195
N  -3.960782 -0.831095 -1.426657
N  0.561264 -0.323366 -0.3539
N  1.20187 0.894696 1.631101
N  -0.758148 -0.014474 0.065464
C  2.91057 -0.059337 0.201922
C  3.319351 -0.789418 -0.940958
C  1.470629 0.178939 0.500703
C  -3.113613 -0.278009 -0.490008
C  4.699458 -0.975278 -1.160705
C  -3.597439 0.443009 0.639951
C  5.624598 -0.429631 -0.238094
C  5.127321 0.285403 0.875559
C  -4.986197 0.598301 0.807144
C  -1.683757 -0.489353 -0.746104
C  -5.862831 0.033233 -0.151986
C  -5.300845 -0.668288 -1.244336
H  2.552365 -1.182693 -1.612767
H  5.050592 -1.534462 -2.034131
H  -2.876775 0.858143 1.350064
H  6.703367 -0.552658 -0.374336
H  5.808487 0.723439 1.613608
H  -5.384257 1.14787 1.667036
H  -1.425978 -1.064881 -1.649185
H  -6.94896 0.131236 -0.058565
H  -5.942867 -1.121478 -2.0089
H  0.225589 1.075039 1.860736
H  1.994491 1.21833 2.188048
