program: Gaussian 09
title: 000267290
version: EM64L-G09RevD.01
frameworkgroup: C1[X(C17H15NO5)]
method: RPBEPBE
basis: SDD
operation: Freq
keyword: #p
keyword: freq=noraman
keyword: PBEPBE/SDD
title: #p freq=noraman PBEPBE/SDD
converged: YES YES NO NO
title: Mulliken charges:
elementType: O O O O O N C C C C C C C C C C C C C C C C C H H H H H H H H H H H H H H H
charge: -0.253762 -0.277874 -0.234086 -0.222099 -0.224840 0.015677 0.423488 0.183905 -0.503695 0.191134 0.250453 -0.534293 -0.251262 -0.317649 0.283183 0.096136 -0.361286 -0.355167 -0.246491 -0.236907 -0.492288 -0.231923 -0.534503 0.287339 0.298389 0.295612 0.254971 0.288639 0.271719 0.239054 0.231205 0.245058 0.233391 0.236061 0.231854 0.248928 0.236089 0.235840
chargesum: 0.00000
title: Mulliken charges with hydrogens summed into heavy atoms:
elementType: O O O O O N C C C C C C C C C C C C C C C C C
charge: -0.253762 -0.277874 -0.234086 -0.222099 -0.224840 0.015677 0.423488 0.183905 -0.216357 0.191134 0.250453 -0.235904 0.044350 -0.062678 0.283183 0.096136 -0.072648 -0.083449 -0.007437 -0.005702 0.222223 -0.000069 0.186355
polarizability: 3.81500988e+02 7.50981573e+00 2.62528304e+02 6.47213065e+00 9.11178367e-01 1.02533738e+02
1716.lowfreq: -6.2905 -4.0868 0.0002 0.0007 0.0009 5.0293 18.4991 20.5416 29.2083
frequency: 18.3778 20.5051 29.1879 42.9114 56.6850 59.1199 101.3596 104.9528 108.4510 135.1439 155.5134 177.7991 181.0964 195.6324 210.5816 219.8223 252.9853 264.9140 298.8095 307.7506 342.6382 375.1639 382.4404 399.1940 418.2645 426.2068 457.1714 465.9363 493.6292 542.7362 584.8071 602.1148 613.8795 618.6420 664.8771 680.4233 701.3863 710.7421 718.7069 729.4707 733.1295 748.6665 789.3728 833.7861 862.2527 875.2354 892.3017 906.6712 925.4045 947.8951 968.8472 985.3370 989.2151 994.3233 1006.1623 1021.3678 1061.0339 1077.2962 1089.4224 1108.2533 1112.1413 1140.6363 1154.4129 1173.8602 1174.2803 1185.3405 1192.6685 1202.7498 1244.0069 1260.8719 1285.4358 1293.2568 1300.3051 1321.8784 1339.9096 1383.3762 1389.3954 1406.5240 1433.3127 1436.6910 1446.8655 1459.9659 1461.0411 1467.9315 1473.9411 1478.0671 1498.6537 1525.8405 1547.6666 1585.7602 1607.2998 1609.1664 1619.2568 2973.5903 3008.5718 3067.4644 3117.8541 3120.8804 3128.3523 3135.5407 3138.4577 3140.8628 3152.9361 3160.6797 3163.3059 3172.6900 3173.0463 3185.9297
redmass: 3.7714 5.3276 4.8339 5.7897 4.4022 9.6936 6.2289 5.7523 4.4142 5.3102 5.3238 2.3280 2.2940 1.6706 3.6035 4.0933 2.9719 1.6595 4.7823 4.6061 6.3753 6.4851 6.1964 3.3848 4.0048 4.2472 3.7009 5.0751 5.7360 7.2163 6.1206 6.4344 6.4596 5.4786 5.2770 5.4276 2.7983 3.2054 3.8429 4.8929 5.8735 4.5826 2.0380 4.9416 1.3908 1.7206 1.6004 1.5616 7.8769 1.3833 1.2331 5.3432 5.5914 1.3693 1.3373 2.6056 3.8405 2.5364 1.8247 1.2425 1.2570 1.6469 1.4643 1.4085 1.9289 1.9136 1.2201 5.2724 1.6640 1.4494 2.9489 3.5118 1.4252 1.3628 7.8327 8.3243 3.5935 6.8672 2.2774 1.2498 1.3152 1.0534 1.0613 1.0492 1.0957 2.2272 3.3471 8.9741 8.0344 6.0852 6.1001 7.0711 6.1633 1.0322 1.0287 1.1047 1.0913 1.1048 1.0853 1.1008 1.1059 1.0887 1.0930 1.0904 1.0955 1.0994 1.0913 1.0901
irintensity: 5.4289 0.8088 1.7747 2.6708 2.4948 0.7536 4.0386 1.6019 7.4574 0.5891 7.0401 5.7159 1.5310 4.1186 7.9480 0.5466 0.9835 0.6101 1.0262 4.5057 0.4101 6.2409 3.3993 0.5270 0.8880 2.8687 2.4055 4.9378 1.6997 31.0093 4.5280 21.4597 0.1742 30.3248 4.7365 6.6919 30.2015 40.3646 12.2275 17.9160 11.5613 1.6911 35.3439 1.0116 1.8177 15.0926 17.6831 33.6351 23.0924 25.1530 63.6154 78.9908 1.0026 6.2180 0.1134 15.8931 38.1431 38.1123 2.4248 0.8387 0.0629 23.1576 38.8240 83.8804 141.1929 40.1042 28.4936 289.8427 319.3083 130.5527 265.7865 164.7856 18.7572 24.4006 139.1138 1.1972 39.2157 19.9815 20.5967 9.5520 1.3735 24.0386 25.9848 14.3902 106.5882 2.3505 269.2176 137.2607 185.5437 8.6290 32.9028 48.8182 32.2409 53.2022 69.7990 32.7438 7.7773 28.9421 1.0173 19.0475 19.1585 9.9955 13.2291 9.0037 15.2456 15.9713 0.2629 5.4805
temp: 298.150 k
press: 1.00000 atm
elementType: 8 8 8 8 8 7 6 6 6 6 6 6 6 6 6 6 6 6 6 6 6 6 6 1 1 1 1 1 1 1 1 1 1 1 1 1 1 1
symmnumber: 1
zpe: 746103.0 jmol-1
zpe.correction: 0.284176 hartree
zpe.thermalcorrener: 0.305752 hartree
zpe.thermalcorrenthalpy: 0.306696 hartree
zpe.thermalcorrgfe: 0.230597 hartree
zpe.sumelectzpe: -1085.903839 hartree
zpe.sumelectthermal: -1085.882262 hartree
zpe.sumelectthermalent: -1085.881318 hartree
zpe.sumelectthermalfe: -1085.957417 hartree
dipole: -6.9885 0.6492 1.4014
dipole: 7.1571
quadrupole: -87.6618 -149.3402 -134.1669
quadrupole: 10.2505 4.2681 -3.6268
quadrupole: 36.0612 -25.6172 -10.4439 10.2505 4.2681 -3.6268
hfenergy: -1086.1880145 hartree
pointgroup: C01 [X(C17H15N1O5)]
dipole: 2.7876778 0.3321207 -0.2179049 debye
polarizability: 378.6934379|-22.863912|221.440247|15.9778862|69.761576|146.4293444 unknown
InChI: InChI=1S/C17H15NO5/c1-22-16-10-13(14(18(20)21)11-17(16)23-2)8-9-15(19)12-6-4-3-5-7-12/h3-11H,1-2H3
charge 0 multiplicity 1
38 atoms
O  3.552345 -2.517535 -0.857475
O  4.988189 -0.398497 0.573405
O  -3.285302 -2.882174 -0.949916
O  1.352067 2.661892 2.131493
O  -0.620665 1.568747 1.816709
N  0.665319 1.665579 1.663964
C  0.709989 -0.449598 0.253798
C  1.385322 0.598176 0.953831
C  1.537165 -1.44288 -0.324747
C  2.946877 -1.439907 -0.232773
C  3.591697 -0.368217 0.480402
C  2.79567 0.635721 1.054282
C  -0.751672 -0.507369 0.045921
C  -1.459734 -1.675992 -0.041237
C  -3.880511 -0.687669 -0.13982
C  -2.900497 -1.797645 -0.397931
C  -3.711259 0.274422 0.893722
C  -5.05749 -0.650518 -0.937685
C  -4.697972 1.261496 1.110024
C  -6.033507 0.34206 -0.726694
C  5.008298 -2.601741 -1.106051
C  -5.854837 1.303729 0.298473
C  5.642877 0.699178 1.299005
H  1.088868 -2.24483 -0.917443
H  3.232775 1.464654 1.615007
H  -1.274242 0.446439 -0.064042
H  -0.956109 -2.645548 0.073417
H  -2.833287 0.243402 1.545745
H  -5.183405 -1.41558 -1.711054
H  -4.561373 1.99423 1.912492
H  -6.932031 0.368675 -1.352978
H  5.56419 -2.693379 -0.160686
H  5.363831 -1.719612 -1.663318
H  5.116009 -3.5123 -1.714058
H  -6.615161 2.074851 0.466882
H  6.717742 0.476257 1.241052
H  5.319783 0.723044 2.356684
H  5.433139 1.673741 0.819398
