program: Gaussian 09
title: 000267213
version: EM64L-G09RevD.01
frameworkgroup: C1[X(C13H5Cl2FO)]
method: RPBEPBE
basis: SDD
operation: Freq
keyword: #p
keyword: freq=noraman
keyword: PBEPBE/SDD
title: #p freq=noraman PBEPBE/SDD
converged: NO NO NO NO
title: Mulliken charges:
elementType: Cl Cl F O C C C C C C C C C C C C C H H H H H
charge: -0.026013 -0.034584 -0.192000 -0.135831 0.077332 0.343547 0.250402 0.219845 -0.299332 0.255915 -0.389730 -0.418974 -0.383208 -0.337841 -0.069714 -0.189107 -0.109616 0.280110 0.306256 0.303321 0.286469 0.262752
chargesum: 0.00000
title: Mulliken charges with hydrogens summed into heavy atoms:
elementType: Cl Cl F O C C C C C C C C C C C C C
charge: -0.026013 -0.034584 -0.192000 -0.135831 0.077332 0.343547 0.250402 0.219845 -0.299332 0.255915 -0.109619 -0.112717 -0.079887 -0.051371 -0.069714 0.073644 -0.109616
polarizability: 3.08301679e+02 4.52623403e+00 1.64388897e+02 7.00815026e-03 8.68487012e-03 5.74317841e+01
1716.lowfreq: 0.0003 0.0015 0.0024 1.8835 4.1473 12.5490 42.1688 89.5736 106.3218
frequency: 42.1658 89.5721 106.3217 133.6385 152.1515 196.3139 209.6343 215.0369 240.9069 274.1301 306.1843 365.5791 371.4004 394.4451 421.6151 468.9707 472.9588 545.2929 549.1054 569.8346 574.1607 602.0066 670.0796 680.3046 706.9397 752.7947 812.7127 815.3502 843.2780 866.0918 890.1199 909.9635 934.2161 967.6154 973.6392 1009.2335 1055.2706 1071.9970 1106.0882 1163.9983 1191.1672 1218.0246 1232.8093 1268.6014 1357.8612 1359.8936 1414.7360 1430.1607 1441.1676 1472.3024 1587.6704 1592.6911 1596.5206 1614.5452 1640.0507 3159.8957 3167.7264 3176.1910 3177.7302 3184.1272
redmass: 20.1573 7.7378 15.5905 11.1139 5.9243 16.1367 15.4463 6.2909 5.6255 16.4486 8.9829 7.1534 6.4277 12.9024 3.8823 4.7145 8.8580 7.6446 4.4807 4.2959 6.6652 8.2990 4.5351 7.0272 7.7260 4.7455 8.8346 3.5051 1.4072 1.5137 9.0720 1.3834 1.7451 1.3841 8.9797 7.2623 1.9566 1.6081 2.3703 2.2609 1.5334 7.7645 2.0032 1.6626 4.1272 7.6372 4.2834 2.6516 4.5844 5.9008 8.7761 8.5144 8.5714 9.4847 11.8035 1.0894 1.0938 1.0938 1.0974 1.0933
irintensity: 0.1140 1.2322 0.2571 1.7478 0.2415 0.1655 2.1795 0.7340 0.5790 1.4532 1.7774 3.1556 0.5593 28.7915 0.2199 20.3538 2.3912 1.3703 4.0568 2.3662 6.1894 3.5352 4.0767 19.0941 59.3422 5.4771 4.5465 23.0257 30.9805 29.1224 45.6582 0.6457 23.9028 1.7112 12.3787 5.8098 18.6944 24.1444 30.1932 51.6569 6.6347 233.0683 13.7902 7.6198 8.0535 6.3089 32.9566 183.2490 38.5934 2.6280 37.5358 90.4394 22.3694 2.6712 112.0660 1.1661 0.8968 2.0225 2.3412 0.8851
temp: 298.150 k
press: 1.00000 atm
elementType: 17 17 9 8 6 6 6 6 6 6 6 6 6 6 6 6 6 1 1 1 1 1
symmnumber: 1
zpe: 363754.4 jmol-1
zpe.correction: 0.138547 hartree
zpe.thermalcorrener: 0.151928 hartree
zpe.thermalcorrenthalpy: 0.152873 hartree
zpe.thermalcorrgfe: 0.097603 hartree
zpe.sumelectzpe: -1592.436492 hartree
zpe.sumelectthermal: -1592.423110 hartree
zpe.sumelectthermalent: -1592.422166 hartree
zpe.sumelectthermalfe: -1592.477435 hartree
dipole: -0.3031 2.6002 0.0003
dipole: 2.6178
quadrupole: -112.1679 -113.4784 -111.3931
quadrupole: 2.1340 0.0002 -0.0002
quadrupole: 0.1786 -1.1319 0.9533 2.1340 0.0002 -0.0002
hfenergy: -1592.5750385 hartree
pointgroup: C01 [X(C13H5Cl2F1O1)]
dipole: -0.1339852 1.0211665 0.000106 debye
dipolederiv: -0.9908932 -0.144412 -0.0000638 -0.1940344 -0.1332496 -0.0000182 -0.0000836 -0.0000192 -0.0450316 -1.0335372 0.0756606 0.0000107 0.1345795 -0.1145941 -0.0000061 0.000032 -0.0000082 -0.0527234 -0.2035011 -0.1775581 -0.0000199 0.0615079 -0.9812289 -0.0000758 0.000008 -0.000074 -0.1364002 -0.5212295 0.0170191 -0.0000075 0.0103625 -1.0140807 0.000002 -0.0000044 -0.0000951 -0.2848541 0.1867521 -0.0406185 -0.0000044 -0.0774466 -0.1849213 -0.0000208 -0.0000456 -0.0000068 -0.037845 0.2575883 0.1164286 0.0000254 0.0758537 0.0310056 -0.0000025 0.000063 0.0000103 0.0166712 -0.5440217 0.2514968 -0.0000003 0.2502067 -0.1066102 0.0000013 -0.0000122 0.0000057 0.0545613 -0.5790682 -0.2894013 -0.0000332 -0.2292809 -0.2418368 -0.0000196 -0.0000189 -0.0000148 0.0324538 1.3222443 0.0253735 0.0000365 0.0195185 1.2357725 0.0000228 0.0000337 0.0000861 0.1131689 0.1081117 0.2731725 0.0000247 -0.0641725 1.1263935 0.000092 0.0000015 0.0000925 0.1061986 -0.179411 -0.1741519 -0.0000171 -0.040216 0.066859 0.0000183 -0.0000135 0.0000198 -0.1319164 -0.3563788 -0.0622754 -0.000023 0.1435725 0.0250803 0.0000101 -0.000017 0.0000011 -0.0855716 -0.2456892 0.0693435 0.0000094 -0.1663201 0.0653618 0.0000041 0.0000011 0.0000068 -0.0627042 -0.2816122 -0.2312828 -0.0000273 -0.1078024 -0.2027425 -0.0000139 -0.000022 -0.0000229 -0.0917227 1.4394982 0.2323257 0.0001124 0.1974752 0.2061989 0.0000364 0.0001337 0.0000433 -0.0765591 -0.2110693 0.1473354 0.0000112 0.1755088 -0.0146588 0.000006 0.0000184 0.0000006 -0.080066 1.4633156 -0.1304172 -0.0000289 -0.1935642 0.0432429 0.0000136 -0.0000588 0.0000154 -0.0834529 0.0716561 0.0611599 0.0000061 0.0312845 -0.0011342 -0.000014 -0.0000047 -0.0000147 0.163564 0.1069119 -0.0028657 -0.0000044 -0.0393725 0.0449437 -0.000011 -0.0000076 -0.0000063 0.1728584 0.1000007 0.0100503 0.0000015 0.0470594 0.0402736 -0.0000086 0.0000044 -0.0000058 0.1661834 0.0660178 0.0411707 -0.000003 0.0332776 0.0736906 -0.0000063 -0.00001 -0.0000062 0.1816826 0.0243146 -0.0675536 -0.000005 -0.0679971 0.0362346 -0.0000095 0.0000026 -0.0000076 0.1615051 unknown
polarizability: 308.1412199|6.5994784|164.5493558|0.0068822|0.008785|57.4317841 unknown
InChI: InChI=1S/C13H5Cl2FO/c14-6-1-2-8-9(3-6)13(17)10-4-7(15)5-11(16)12(8)10/h1-5H
charge 0 multiplicity 1
22 atoms
Cl -5.1666 -0.664635 -0.000206
Cl 5.347839 -0.23197 0.000093
F  -1.339731 2.847648 0.00032
O  0.192094 -2.983868 -0.000101
C  -0.681125 0.509845 0.000176
C  0.79852 0.57695 0.000219
C  -1.089956 -0.857446 0.000051
C  1.301781 -0.759327 0.000121
C  0.147601 -1.725603 0.000092
C  -1.684644 1.484141 0.000196
C  1.690385 1.665006 0.000302
C  -2.434487 -1.251645 -0.000067
C  2.675249 -1.039769 0.000077
C  -3.05448 1.143783 0.000085
C  -3.405969 -0.221508 -0.000048
C  3.085439 1.39979 0.000269
C  3.55373 0.067876 0.000152
H  1.330985 2.697718 0.000392
H  -2.714209 -2.308397 -0.000154
H  3.043304 -2.06987 0.000007
H  -3.812798 1.93118 0.000099
H  3.802571 2.226101 0.000324
