program: Gaussian 09
title: 000267260
version: EM64L-G09RevD.01
frameworkgroup: C1[X(C19H20Cl2N6O4)]
method: RPBEPBE
basis: SDD
operation: Freq
keyword: #p
keyword: freq=noraman
keyword: PBEPBE/SDD
title: #p freq=noraman PBEPBE/SDD
converged: YES YES NO NO
title: Mulliken charges:
elementType: Cl Cl O O O O N N N N N N C C C C C C C C C C C C C C C C C C C H H H H H H H H H H H H H H H H H H H H
charge: -0.071491 -0.071425 -0.259772 -0.259946 -0.347228 -0.347533 -0.386434 -0.386449 -0.367932 -0.367610 -0.464597 -0.464454 -0.398453 -0.508555 -0.508302 0.209199 0.208840 0.586647 0.586563 0.365206 0.365376 -0.354645 -0.354659 -0.312741 -0.312588 -0.218859 -0.218843 -0.217976 -0.218029 -0.242414 -0.242372 0.237700 0.237888 0.244083 0.231468 0.243919 0.231411 0.419476 0.419531 0.318485 0.318495 0.305056 0.305168 0.307210 0.307265 0.256718 0.256742 0.232940 0.232970 0.237464 0.237487
chargesum: 0.00000
title: Mulliken charges with hydrogens summed into heavy atoms:
elementType: Cl Cl O O O O N N N N N N C C C C C C C C C C C C C C C C C C C
charge: -0.071491 -0.071425 -0.259772 -0.259946 -0.347228 -0.347533 0.033042 0.033082 -0.049447 -0.049115 -0.159541 -0.159286 0.077136 -0.033005 -0.032972 0.209199 0.208840 0.586647 0.586563 0.365206 0.365376 -0.354645 -0.354659 -0.005530 -0.005322 0.037859 0.037899 0.014963 0.014941 -0.004950 -0.004885
polarizability: 3.26325423e+02 6.45659436e-02 2.52688841e+02 -1.31129989e+01 3.60304300e-01 2.96618709e+02
1716.lowfreq: -0.0006 0.0011 0.0019 2.0542 3.4462 7.6102 11.3386 16.2943 17.5514
frequency: 11.3238 16.2449 17.5001 33.9471 43.1349 48.5421 61.7925 63.0290 65.9967 71.4711 91.5806 106.0850 111.3749 125.6940 144.8754 147.3283 155.5280 157.5597 163.6182 225.0036 228.4374 234.6844 253.5375 260.6028 267.6584 269.7962 271.8401 296.2072 342.0109 353.7353 372.6036 376.8701 417.8849 422.2275 422.4845 426.5493 430.8729 442.6011 443.0107 451.4194 452.7245 536.2611 536.3609 573.3013 575.7873 630.6518 633.1984 652.1620 652.3049 669.6350 675.9896 676.4097 701.4759 703.8504 719.1005 719.4730 737.9263 759.4722 759.9526 770.5765 773.1740 807.4308 825.3723 837.8548 849.8270 857.2851 869.1090 869.2569 912.3738 915.6966 947.3984 947.4762 956.8644 991.9973 992.0453 993.2913 994.2884 1000.0964 1008.3145 1012.4374 1029.5579 1039.1248 1040.2153 1069.5210 1121.5027 1127.0289 1127.8205 1134.5015 1170.5455 1171.3030 1175.8573 1178.9537 1226.8072 1227.0930 1243.7768 1245.0958 1250.4814 1284.9116 1299.9541 1311.2180 1311.8084 1330.0334 1348.2047 1353.2115 1373.6847 1375.5273 1428.4528 1429.5983 1453.7464 1457.9399 1458.1380 1471.3913 1471.9455 1474.6162 1476.6846 1528.3402 1531.7503 1534.2911 1538.0643 1581.8529 1582.2508 1608.2699 1611.3326 1619.2105 1621.5866 1642.1659 1650.9904 3005.3592 3005.5517 3014.2604 3062.2552 3068.8879 3083.1771 3143.3258 3143.3429 3148.1217 3160.2995 3160.3524 3169.4680 3178.0941 3178.1856 3197.7186 3197.8603 3470.5345 3470.7298 3506.4480 3506.8817
redmass: 9.7320 7.4318 8.5480 6.5083 8.0500 8.1833 5.4458 6.3511 6.1441 5.6860 8.2887 7.3586 9.2665 6.7503 7.7416 6.0378 4.9660 5.0959 4.5002 3.5294 3.0658 2.5710 3.4286 3.3235 4.7963 3.9611 7.1715 5.5894 4.6468 4.8991 9.2606 10.6687 3.2204 5.9922 6.9126 2.5788 2.8152 2.8889 2.8125 4.9483 3.6726 3.3774 3.3794 5.7090 4.9546 5.9345 5.1005 1.4052 1.3938 2.4766 6.9395 6.8226 7.2581 7.3403 3.6894 3.7520 4.2016 1.2453 1.2541 5.6367 5.7557 2.0338 1.3812 5.2460 3.0136 3.2385 1.3495 1.3507 1.9662 3.1068 1.3579 1.3579 1.7881 1.3272 1.3209 6.2284 2.1046 5.9351 6.8949 6.0361 1.9339 2.0104 1.9650 2.7834 2.0522 1.6096 1.5429 1.5552 1.2669 1.1244 1.7218 2.0758 2.0326 1.9515 1.5146 1.5827 1.5160 2.3098 2.1597 1.8979 1.8729 1.6211 1.5530 1.5436 5.7509 5.8720 2.5320 2.5027 1.0882 2.1971 2.2085 1.2262 1.1252 1.7998 1.5851 2.5885 2.2016 1.4776 1.6346 4.9643 4.7628 6.1432 6.7687 4.4981 4.9505 3.4882 3.8438 1.0595 1.0584 1.0620 1.1025 1.1022 1.1045 1.0867 1.0867 1.0960 1.0920 1.0921 1.0920 1.0984 1.0983 1.0949 1.0949 1.0759 1.0759 1.0775 1.0775
irintensity: 0.0404 0.2063 0.1020 0.2635 3.7911 0.0244 3.0114 0.4630 0.9804 2.0874 8.0608 4.5742 2.7945 16.0529 0.4265 7.7967 0.1443 5.7648 23.8128 9.5255 7.6422 4.1564 2.2772 5.7776 15.6906 7.0402 0.1027 5.1259 14.1599 7.9005 4.9124 33.1937 3.8187 0.1004 3.7700 0.8276 16.3668 35.9093 34.0687 5.3285 70.5710 15.2843 12.4574 0.8126 20.0744 1.8633 24.7765 55.1254 59.5270 3.9414 0.5489 22.3082 27.4127 23.3352 5.9654 4.8800 4.9159 74.3716 151.9169 36.6893 15.4525 2.4732 130.9906 1.4146 26.1484 4.1199 2.5545 5.6424 0.0122 46.3624 2.9251 6.1627 1.0879 2.3537 2.5582 40.6270 3.6032 21.8567 55.9220 9.6763 14.1589 19.3457 2.6068 4.6989 11.8023 0.4869 7.0993 52.4784 2.1324 3.0726 5.1422 11.4256 246.3138 218.4292 2.5112 23.2388 1.0819 84.0849 8.8600 86.6012 38.9779 7.6431 2.4721 37.6011 195.0405 73.6077 150.3585 31.7821 17.5263 141.4930 27.9089 4.1209 6.1553 72.0066 81.0444 1008.1695 723.9306 175.2971 2.7197 78.2704 29.9831 488.1103 68.8127 132.1944 81.4083 33.7018 86.0418 24.7708 7.5532 23.4994 8.0600 31.0467 21.6523 2.3073 1.9441 390.1820 13.8189 7.3802 2023.7194 5.9049 8.5461 6.1399 5.8080 88.8920 33.9263 57.8127 38.0263
temp: 298.150 k
press: 1.00000 atm
elementType: 17 17 8 8 8 8 7 7 7 7 7 7 6 6 6 6 6 6 6 6 6 6 6 6 6 6 6 6 6 6 6 1 1 1 1 1 1 1 1 1 1 1 1 1 1 1 1 1 1 1 1
symmnumber: 1
zpe: 1004600.4 jmol-1
zpe.correction: 0.382632 hartree
zpe.thermalcorrener: 0.412282 hartree
zpe.thermalcorrenthalpy: 0.413226 hartree
zpe.thermalcorrgfe: 0.317699 hartree
zpe.sumelectzpe: -2283.338923 hartree
zpe.sumelectthermal: -2283.309273 hartree
zpe.sumelectthermalent: -2283.308329 hartree
zpe.sumelectthermalfe: -2283.403856 hartree
dipole: -0.0131 -4.3198 0.0116
dipole: 4.3199
quadrupole: -183.4008 -203.4779 -178.3941
quadrupole: -0.0216 -15.5103 0.0567
quadrupole: 5.0234 -15.0537 10.0302 -0.0216 -15.5103 0.0567
hfenergy: -2283.7215548 hartree
pointgroup: C01 [X(C19H20Cl2N6O4)]
dipole: -0.0724892 -1.6978471 -0.0242638 debye
polarizability: 325.5588736|-2.5851646|252.7799789|-13.8430175|0.147663|297.2941209 unknown
InChI: InChI=1S/C19H20Cl2N6O4/c20-12-6-1-3-8-14(12)22-18(30)26-24-16(28)10-5-11-17(29)25-27-19(31)23-15-9-4-2-7-13(15)21/h1-4,6-9,22-27H,5,10-11H2
charge 0 multiplicity 1
51 atoms
Cl 5.631411 -2.452704 1.762598
Cl -5.765136 -1.958167 -1.871836
O  2.296104 3.113343 1.7569
O  -2.015187 3.339305 -1.696087
O  1.814979 0.290853 -0.782525
O  -1.758812 0.410438 0.755932
N  0.733033 1.401096 1.516688
N  -0.589659 1.505468 -1.507677
N  1.738637 0.426454 1.558128
N  -1.667812 0.613364 -1.57959
N  3.421605 -0.822086 0.535301
N  -3.446736 -0.528914 -0.595002
C  0.192498 4.584524 0.056457
C  -0.055258 3.720674 1.324911
C  0.374267 3.750698 -1.24301
C  1.098928 2.749393 1.557384
C  -0.850155 2.878317 -1.506037
C  4.203275 -1.463141 -0.455204
C  -4.277773 -1.137499 0.375697
C  2.311775 -0.002145 0.352061
C  -2.275014 0.193107 -0.387108
C  5.295025 -2.274847 -0.039265
C  -5.424767 -1.854405 -0.064962
C  3.970463 -1.346842 -1.853651
C  -4.04333 -1.076505 1.777344
C  6.130233 -2.947089 -0.943209
C  -6.311426 -2.487181 0.818229
C  4.80402 -2.019336 -2.770583
C  -4.92837 -1.710089 2.673511
C  5.882438 -2.818797 -2.329469
C  -6.060941 -2.415311 2.208064
H  -0.665677 5.26798 -0.074145
H  1.100685 5.194537 0.210317
H  -1.015577 3.180014 1.240651
H  -0.121899 4.390741 2.201684
H  1.291706 3.137328 -1.18183
H  0.490419 4.445202 -2.095304
H  -0.228003 1.069528 1.277317
H  0.34274 1.092114 -1.282387
H  2.275888 0.386549 2.428892
H  -2.206221 0.645802 -2.449995
H  3.730068 -1.004436 1.496506
H  -3.766452 -0.657376 -1.561223
H  3.137474 -0.727559 -2.189455
H  -3.16802 -0.530367 2.13186
H  6.957362 -3.557975 -0.57093
H  -7.179801 -3.024788 0.427365
H  4.605422 -1.913554 -3.842277
H  -4.72734 -1.648211 3.748184
H  6.526673 -3.33765 -3.045837
H  -6.744959 -2.904253 2.908422
