program: Gaussian 09
title: 000024999
version: EM64L-G09RevD.01
frameworkgroup: C1[X(C8H15ClO2)]
method: RPBEPBE
basis: SDD
operation: Freq
keyword: #p
keyword: freq=noraman
keyword: PBEPBE/SDD
title: #p freq=noraman PBEPBE/SDD
converged: YES YES NO NO
title: Mulliken charges:
elementType: Cl O O C C C C C C C C H H H H H H H H H H H H H H H
charge: -0.080497 -0.266679 -0.239156 -0.357651 -0.369084 -0.316978 -0.513064 -0.600645 0.239552 -0.226508 -0.672256 0.192453 0.191712 0.222426 0.216577 0.223401 0.222837 0.245263 0.243429 0.258960 0.258899 0.227638 0.228148 0.212117 0.229591 0.229515
chargesum: 0.00000
title: Mulliken charges with hydrogens summed into heavy atoms:
elementType: Cl O O C C C C C C C C
charge: -0.080497 -0.266679 -0.239156 0.026514 0.069918 0.129260 -0.024371 -0.082786 0.239552 0.229278 -0.001033
polarizability: 1.46100641e+02 7.71738124e+00 9.08610080e+01 -8.02658232e-02 -3.95676672e-01 7.35176758e+01
1716.lowfreq: -12.2938 -6.0611 -0.0029 -0.0028 -0.0020 5.4606 15.4188 38.6019 46.1480
frequency: 6.1364 38.3323 46.0361 50.7965 64.0638 107.6683 121.2168 133.4055 154.0477 188.7299 213.4501 251.5857 322.0112 358.6513 388.1131 476.2439 548.5012 666.3035 690.7633 729.5987 760.3640 797.8411 812.9146 822.6396 907.2076 933.0828 1012.8158 1028.8030 1031.0459 1061.6013 1076.3493 1090.3823 1112.1173 1114.4531 1131.6548 1136.1420 1216.8792 1224.0664 1248.1543 1266.9180 1269.7080 1290.1685 1292.4834 1315.0288 1346.5510 1356.1918 1367.4656 1400.6920 1440.2726 1456.1855 1463.8341 1467.2789 1472.6780 1474.1734 1486.5320 1486.9429 1641.1647 2957.7945 2986.2158 2995.6595 2996.9571 3001.0455 3003.5811 3009.9490 3032.6229 3045.9297 3056.2030 3067.9149 3068.4561 3092.2144 3107.3820 3128.3898
redmass: 3.1555 2.8614 4.3007 3.4883 2.4917 1.9512 4.8146 2.3346 2.0329 7.1633 4.5955 1.2666 5.0508 3.3836 4.5668 3.4516 2.6657 6.9855 5.4057 1.1107 1.1395 1.0989 3.5098 1.3267 6.1273 1.3384 3.1375 3.0466 4.0961 1.2312 2.2550 3.9156 1.7728 1.6361 2.8813 1.4807 1.4317 1.2589 1.1348 1.2189 1.2679 1.0640 1.1150 1.3789 1.4221 1.4529 1.6937 1.2683 1.0860 1.0983 1.0403 1.0693 1.0900 1.0584 1.0876 1.0814 9.7516 1.0587 1.0615 1.0358 1.0602 1.0610 1.0985 1.0582 1.0985 1.0563 1.1037 1.1055 1.1047 1.0985 1.1026 1.1114
irintensity: 0.2716 0.0540 0.0266 0.0667 1.3894 0.5129 2.9562 0.0116 7.4813 0.4275 11.4883 1.5663 2.4784 1.4514 20.3361 1.5895 1.4708 25.3187 15.3100 14.2444 1.0291 4.6708 4.1668 3.9678 19.1738 0.3313 3.3604 65.5502 58.5224 1.0616 3.3034 33.7561 23.3189 3.5534 273.1802 11.1326 0.8537 43.5794 0.0096 18.6462 61.9205 0.0393 1.2887 5.3727 28.0841 0.2246 20.6598 18.2718 23.4787 2.5619 12.0370 0.1114 0.7460 5.1726 2.1522 32.1877 169.1521 25.1102 5.9553 21.8090 1.7078 42.4355 14.5699 21.1012 0.2397 30.3253 0.5562 8.1796 72.2863 30.5108 46.4492 28.6996
temp: 298.150 k
press: 1.00000 atm
elementType: 17 8 8 6 6 6 6 6 6 6 6 1 1 1 1 1 1 1 1 1 1 1 1 1 1 1
symmnumber: 1
zpe: 573721.6 jmol-1
zpe.correction: 0.218519 hartree
zpe.thermalcorrener: 0.232670 hartree
zpe.thermalcorrenthalpy: 0.233614 hartree
zpe.thermalcorrgfe: 0.173016 hartree
zpe.sumelectzpe: -923.467134 hartree
zpe.sumelectthermal: -923.452983 hartree
zpe.sumelectthermalent: -923.452039 hartree
zpe.sumelectthermalfe: -923.512637 hartree
dipole: -3.3283 -2.6997 0.0822
dipole: 4.2864
quadrupole: -82.4435 -79.1814 -72.1922
quadrupole: -2.4917 0.7200 -0.2337
quadrupole: -4.5044 -1.2424 5.7468 -2.4917 0.7200 -0.2337
hfenergy: -923.6856533 hartree
pointgroup: C01 [X(C8H15Cl1O2)]
dipole: -1.2910459 1.0846516 0.0249461 debye
dipolederiv: -0.7081513 0.0976241 -0.0107312 0.2109457 -0.256108 0.0050179 -0.01363 0.0031515 -0.1922894 -1.7661245 0.2926888 0.0388285 0.3245943 -0.5794103 -0.0310184 0.0511588 -0.0300689 -0.2858825 -0.7342173 -0.0802517 -0.0062768 0.2870298 -0.9125725 -0.0557492 0.0328102 -0.051035 -0.2994294 -0.0831463 -0.0010448 -0.0055247 -0.1316173 0.1186766 0.0002454 -0.0009311 0.0035427 0.2062852 0.051988 0.0102527 -0.000766 0.0467283 0.0444683 -0.000037 -0.0084105 -0.0055399 0.1512246 -0.1925941 -0.0123771 -0.0051315 0.0651413 -0.0106734 0.0038856 -0.0062995 0.0023893 0.124064 -0.2839535 -0.0934077 -0.0029426 -0.2883668 -0.108047 -0.0104769 0.0121069 -0.0024639 0.1479435 0.7916086 -0.2102587 0.0142871 -0.1960214 0.2993055 -0.005124 0.0143171 -0.0053546 0.2193058 1.7689971 -0.1229826 -0.032758 -0.5210036 1.2258049 0.0928663 -0.0925905 0.0857304 0.1811317 0.900984 -0.0367854 -0.0081639 0.1535092 0.2347442 -0.010531 0.0102553 -0.0095364 0.3508289 -0.1092729 0.0813583 0.0092558 0.0590075 0.0049317 -0.0067236 0.0073948 -0.0066643 0.0610095 0.0497308 0.0068645 0.005929 0.0079661 -0.0465081 -0.1155409 0.0039954 -0.138578 -0.0800008 0.0501296 0.0020432 -0.0013639 0.0050401 -0.0353949 0.1145692 -0.0008372 0.1370923 -0.0920607 0.0547436 0.0090513 0.0131969 0.0148125 -0.0073156 -0.0964914 0.0032867 -0.1042627 -0.0530211 0.043788 0.0060248 -0.0099312 0.0090713 -0.0043189 0.0991075 0.0011749 0.1085875 -0.0695351 0.0610561 -0.0031527 -0.0081984 -0.0134969 -0.0136731 -0.1017323 0.0039531 -0.1095921 -0.0502383 0.0610017 -0.0062558 0.0122315 -0.0168811 -0.0045861 0.0995936 0.0007191 0.1078705 -0.0600108 0.0476524 -0.0027653 0.0097066 0.0463976 0.0280305 -0.0845799 0.0148538 -0.1089465 -0.0196821 0.047756 -0.0142203 -0.0034152 0.0336083 0.0291926 0.0849993 -0.0182797 0.1055466 -0.0254558 -0.0163389 0.0591683 -0.0124232 0.0197119 -0.0192882 0.08932 0.0222553 0.1131837 -0.0436941 -0.0161909 0.0635328 0.0104502 0.0217169 -0.0284148 -0.0892431 -0.0225328 -0.1117199 -0.0350662 -0.0458746 0.0243357 0.026954 -0.0611172 0.0144649 -0.0839218 -0.0223152 -0.0973842 -0.0801611 -0.0463585 0.0316964 -0.022596 -0.062347 -0.0210224 0.0954338 0.0100555 0.1069747 -0.0431044 -0.1486829 -0.0696328 -0.0035762 -0.0937712 0.036462 -0.0060083 -0.0055322 -0.0064047 0.1147551 0.1104222 -0.0142138 -0.0362719 0.0385107 0.0261068 -0.0960589 -0.0016087 -0.1097693 -0.0834409 0.1110476 -0.0172921 0.029231 0.0408311 -0.0148548 0.1081981 0.0046304 0.123251 -0.0434755 unknown
polarizability: 145.8157731|-8.6728746|91.1225852|0.3315506|0.6761607|73.5409668 unknown
InChI: InChI=1S/C8H15ClO2/c1-2-11-8(10)6-4-3-5-7-9/h2-7H2,1H3
charge 0 multiplicity 1
26 atoms
Cl 6.13712 -0.366879 0.096185
O  -2.94614 0.462652 0.00507
O  -1.842376 -1.580938 -0.190877
C  2.008424 0.599167 0.004309
C  0.750009 -0.29704 0.002071
C  3.314923 -0.23365 0.045145
C  -0.548865 0.530583 -0.037819
C  4.548914 0.667892 0.045791
C  -1.799966 -0.333777 -0.083373
C  -4.255803 -0.26066 -0.045986
C  -5.347694 0.798159 0.066126
H  1.976271 1.283175 0.877983
H  2.006156 1.242708 -0.900231
H  0.775519 -0.981622 -0.866528
H  0.748134 -0.943627 0.9003
H  3.35342 -0.911542 -0.82854
H  3.32369 -0.871885 0.949024
H  -0.624116 1.203114 0.838278
H  -0.563626 1.19426 -0.925499
H  4.631604 1.273159 -0.870435
H  4.600868 1.314054 0.93596
H  -4.304982 -0.823112 -0.996025
H  -4.282204 -0.988686 0.78494
H  -6.341771 0.316019 0.033703
H  -5.261924 1.354028 1.015402
H  -5.284384 1.519747 -0.766277
